Home > Error Code > Install Failed. Msi Returned Error Code 1624

Install Failed. Msi Returned Error Code 1624

Contents

I'm going to assume you've downloaded CAE, rather than installing from a physical CD.I'd advise taking these steps:#1 - Go to your temporary files folder, and clean it (type %TEMP% into You must install a Windows service pack that contains a newer version of the Windows Installer service. ERROR_INSTALL_ALREADY_RUNNING 1619 This installation package could not be opened. ERROR_INVALID_FIELD 1618 Another installation is already in progress. check over here

ERROR_INSTALL_LOG_FAILURE1622There was an error opening installation log file. ERROR_APPHELP_BLOCK 1601 The Windows Installer service could not be accessed. ERROR_INSTALL_UI_FAILURE 1622 Error opening installation log file. Specified Modify [3] operation invalid for table joins. 2276: Database: [2].

Msi Error Code 1603

Answered 01/23/2004 by: AppDeploy.com Please log in to comment Please log in to comment 1 Issue can be that the transform is marked Windows Installer 3.n only (in my example, Schema System error: [3]. 2265: Could not commit storage. Installation of this version cannot continue.

  1. Sign up!
  2. ERROR_PATCH_PACKAGE_OPEN_FAILED 1636 This patch package could not be opened.
  3. Reason: Member has been banned from the site For more information, visit our FAQ's.
  4. Table... 2255: Database: [2] Transform: Column with this name already exists.
  5. If the installer is a script file it may be due to a coding issue.
  6. I am running PDQ Deploy ver. 2.3.8.0.

Expected product version == [... 2750: "Transform [2] invalid for package [3]. This message is indicative of a success. ERROR_INSTALL_PACKAGE_INVALID1620This installation package could not be opened. Windows Installer Error 1619 System error: [3]. 2268: Database: [2].

Missing FROM clause in SQL query: [3]. 2239: Database: [2]. Windows Installer Error Codes A script requ... 1721: There is a problem with this Windows Installer package. More info here. 1620 ERROR_INSTALL_PACKAGE_INVALID This installation package could not be opened. Verify that the patch package exists and is accessible, or contact the application vendor to verify that this is a valid Windows Installer patch package.

Available beginning with Windows Installer version 3.0. Windows Installer Returned 1613 Vmware Sorry, we couldn't post your feedback right now, please try again later. Permalink 0 Mahyar Arani June 18, 2013 19:22 thanks for quick response and document link, that will help a lot... This does not include installs where the ForceReboot action is run.       Show: Inherited Protected Print Export (0) Print Export (0) Share IN THIS ARTICLE Is this page helpful?

Windows Installer Error Codes

Invalid update data type in column [3]. 2211: Database: [2]. http://www.itninja.com/question/help-with-msi-1624 This happens when you try to install a product while another installation is in progress. Msi Error Code 1603 GetLastError: [2]. 2359: Unable to create the target file - file may be in use. 2360: Progress tick. 2361: Need next cabinet. 2362: Folder not found: [2]. 2363: Could not enumerate Msi Motherboard Error Codes Veritas does not guarantee the accuracy regarding the completeness of the translation.

ERROR_INSTALL_SERVICE_SAFEBOOT 1652Windows Installer is not accessible when the computer is in Safe Mode. http://colvertgroup.com/error-code/install-failed-with-error-code-1602.php There is a possibility that XLite has a different meaning for 1. What are all those MSI files in the C:\WINNT\Installer directory? Verify that the destination folder exi... 1910: Could not remove shortcut [2]. Exit Code 1618

Verify that the program to be upgraded exists on your computer and that you have the correct upgrade patch. 3010 ERROR_SUCCESS_REBOOT_REQUIRED A restart is required to complete the install. ERROR_BAD_CONFIGURATION1610The configuration data for this product is corrupt. No Yes How can we make this article more helpful? this content Installation of... 1639: Invalid command line argument.

Available beginning with Windows Installer version 3.0. There Was An Error Applying Transforms. Verify That The Specified Transform Paths Are Valid. You must install a Windows service pack that contains a newer version of the Windows Installer service. Verify your license key has been entered correctly.  -2146498520 - Insufficient disk space, most commonly used in service packs -2146498046 - The installation file is intended for a different architecture (e.g.

System error: [3]. 2262: Stream does not exist: [2].

Any remaining transforms in the patch will be skipped.TRANSFORM: The minimum 'Media.DiskId' value inserted by a patch transform is 100TRANSFORM: The maximum 'Media.DiskId' value inserted by a patch transform is 100TRANSFORM: Must restart to comp... 1904: Module [2] failed to register. Verify that you have suffic... 1923: Service '[2]' ([3]) could not be installed. Windows Installer Returned 1639 Data access failed, out of memory. 2202: Database: [2].

Verify that the patch package... 1636: This patch package could not be opened. ERROR_INSTALL_NOTUSED1634Component is not used on this machine. Column '[3]' not present or ambiguous in SQL query: [4... 2236: Database: [2]. have a peek at these guys Available beginning with Windows Installer version 3.0.

Does XLite have additional files that are needed for the installation. Contact your supp... 1611: The component qualifier not present. 1612: The installation source for this product is not available. Any help is much appreciated!   Permalink 0 Osirisgonzalez June 25, 2014 20:59 Hello.  I am trying to UNINSTALL MS Forefront Endpoint Protection.  Here is the error I get: Return code: ERROR_CALL_NOT_IMPLEMENTED 1259 This error code only occurs when using Windows Installer version 2.0 and Windows XP or later.

Permalink 0 Tmoseley November 07, 2014 18:52 "Package returned error code -2147467259"   I was trying to deploy a ninite.exe /silent Just trying to stream line a little further.  Permalink 0 Contact your support personel to verify that the Service is properly registered. Verify that you have suffic... 1922: Service '[2]' ([3]) could not be deleted. Script version: [3], minimum version... 2927: ShellFolder id [2] is invalid. 2928: Exceeded maximum number of sources.

Table does not exist: [3]. 2206: Database: [2]. ERROR_INSTALL_REMOTE_DISALLOWED1640The current user is not permitted to perform installations from a client session of a server running the Terminal Server role service. GetLastError: [2]. 2331: Error loading library [2] or finding entry point [3]. 2332: Error getting file attributes. Email Address (Optional) Your feedback has been submitted successfully!

No path exists for entry [2] in Directory t... 2707: Target paths not created. Answers 7 -2147287038: %1 could not be found. 13: The data is invalid. 120: This function is not available for this platform. Thank you. Attempting to install Windows 7 Service Pack 1 32-bit installation on a 64 bit system) -2145124330 - Install not allowed.

Yes No Additional feedback? 1500 characters remaining Submit Skip this Thank you! System error [3]. 1410: Could not increase the available registry space. [2] KB of free regis... 1500: Another installation is in progress. Contact ... 1634: Component is not used on this machine 1635: This patch package could not be opened.