Home > Installshield Error > Installshield Error 6016

Installshield Error 6016

Your computer should also run faster and smoother after using this software. I open an older InstallShield project to convert it and I get: ISDEV : fatal error -6016: Could not copy the template Upgrade completed with 1 errors, 0 warnings Anyone have Forums Archive > SQL Anywhere > General Discussion > "Silent Deploy" Silent Deploy 3 posts in General Discussion . Thanks! http://colvertgroup.com/installshield-error/installshield-error-105.php

When I try to load any of the .ism files in InstallShield, I get error -6016. So, it can appear you have half a drive left of room, b ut still have hit the end of your quota assigned by your boss or IT department for each Make sure that they are not > marked readonly. > > > "Chris Keating (iAnywhere Solutions)" > wrote in message > > news:[email protected] That's a computer at work, I did the /scannow, chkdsk commands and no errors in result, checked if Visual C++ needed repair, nothing, we have a good AV program, Virus definition Bonuses

a stepwise conversion. Product Manager Posts: 17969 Liked: 951 times Joined: Mon Mar 30, 2009 9:13 am Full Name: Vitaliy Safarov Private messageWebsite Top Re: Rollback during VeeamReporter Free installation by schedlbauerm » Use the Apps and Features or Programs and Features page in the Control Panel to repair or reinstall the app. Individual products have links to the respective forums on SCN, or you can go to SCN and search for your product in the search box (upper right corner) to find your

This repair tool will locate, identify, and fix Windows errors. Example: C:\Program Files\Application\*.*

0 0 12/13/12--09:52: Q107786: ERRDOC: Build Error 5008 Contact us about this article When building an InstallShield project, the following error may occur: Error -5008: Intel64 must Please try again now or at a later time. Sometimes with Microsoft products there is no "cure" except to avoid what triggers the problem.

Don't understand how turning the indexing off will solve a problem that appears once every 90 times(the lowest number I saw on forums)Thanks for your help any ways, sorry for taking Get involved now!Real-Time ActivityMy Tracked DiscussionsFAQsPoliciesModerators Resolved Question Runtime Error R6016 by NickNn1 / March 10, 2015 6:59 AM PDT Hello Guys,I get on a computer the "Runtime Error R6016 - I checked the application and it is > not read-only. > > Has anyone experienced this? When I try to load any > of the .ism files in InstallShield, I get error -6016. © Copyright Tue Oct 18 22:49:49 UTC 2016, SAP Inc. - Forums Archive v

C Runtime Error R6016 Visual Studio 2015 Other Versions Visual Studio 2013 Visual Studio 2012 Visual Studio 2010 Visual Studio 2008 Visual Studio 2005 Visual Studio .NET 2003  not enough space Track this discussion and email me when there are updates If you're asking for technical help, please be sure to include all your system info, including operating system, model number, and Ein Backup unter dem namen xxx.ism.757 wurde erstellt. I can't provide any screenshots due to company's policies.

  • Flag Permalink Reply This was helpful (0) Collapse - No problem.
  • An "Install" dialog with the content "Internal Error 2318.
  • Make sure the file exists in the specified location and that the file is a valid REG file." [1] is a placeholder that contains the full path to the .reg file
  • This error can also appear as: 'Error -6190: Internal build error.'

    0 0 12/20/12--12:39: Q108646: ERRDOC: Build Error 6246 Contact us about this article When building an installation that includes
  • Can anybody give me > anything?
  • See why it earned our Editors' Choice award.
  • This documentation is archived and is not being maintained.
  • by R.
  • Included with that, this informative article will help you to diagnose any common error alerts connected with Repair Ie Error R6016 error code you could be got.
  • Steve Posted on 2005-03-03 20:28:00.0Z Sender: [email protected]: SteveNewsgroups: sybase.public.sqlanywhere.generalSubject: Re: Silent DeployX-Mailer: WebNews to Mail Gateway v1.1tMessage-ID: <[email protected]>References: <[email protected]>X-Original-NNTP-Posting-Host: 10.22.241.42X-Original-Trace: 3 Mar 2005 12:27:57 -0800, 10.22.241.42Lines: 28X-Original-NNTP-Posting-Host: forums-2-dub.sybase.comX-Original-Trace: 3 Mar 2005

Additionally, please make sure you meet all system requirements for Veeam Reporter 4. http://blaisdell5.rssing.com/chan-3990948/all_p12.html If it's really old (several versions) you might have to convert it in two steps. Download Error Fixer . However there was a clue there and something I would try to lighten the load on what can trigger that error.Bob Flag Permalink Reply This was helpful (0) Collapse - Sorry

Make sure that they are not marked readonly. "Chris Keating (iAnywhere Solutions)" wrote in message news:[email protected] > What version of InstallShield are you using? > > wrote in message http://colvertgroup.com/installshield-error/installshield-error-1633.php I hope this helps. Mark wrote in message news:[email protected] > Has anyone successfully used the InstallShield Merge Modules > to create an OEM installation of ASA? Preview post Submit post Cancel post You are reporting the following post: Runtime Error R6016 This post has been flagged and will be reviewed by our staff.

by NickNn1 / March 11, 2015 7:07 AM PDT In reply to: We've disabled it for years. Flag Permalink Reply This was helpful (0) Collapse - Which is why I thought about the indexer. They're not read-only. > A Google search indicates that this could be caused by the > files being set to readonly. have a peek at these guys View answer Answer This Ask For Clarification Discussion is locked Flag Permalink You are posting a reply to: Runtime Error R6016 The posting of advertisements, profanity, or personal attacks is prohibited.

Can anybody give me > anything? Tindra Jan. 16th, 2015 Are you experiencing Error Runtime Error 6016? It worked fine (even sybase central !!) If you require any further info/tips please contact me.

Since it's a company just move to calling Microsoft for a fix.

Flexera Software Community Forums > Products > InstallShield > InstallShield 2012 > ISDEV: fatal error -6016 PDA View Full Version : ISDEV: fatal error -6016 RoadRunner03-27-2012, 08:32 PMI have InstallShield 2012 At least in that articles, you can find out what files are necessary for deployment. Check Event Viewer Check the System and Application logs in Event Viewerfor errors or warnings that might provide more clues on the cause of error Runtime Error 6016.

Still can't C:\WINNT\Installer\" may appear at during the "Searching for installed applications" portion of the setup after starting a first-time installation of an InstallScript MSI project. 0 0 12/20/12--12:48: Q108692: ERRDOC: Build Error

Proffitt Forum moderator / March 11, 2015 7:01 AM PDT In reply to: Indexer Can you share the downside? Clear Your Browser's Cache and RegistryThat's certainly an exaggeration - clearing cache won't fix every broken website or Internet related problem - but it is often helpful.Clearing the cache is very When the Fixing part is finished, your computer has been speeded up and the errors have been fixed Tagged: Runtime Error 6016, Runtime Error 6016 fixer Comments (36) What People Say: http://colvertgroup.com/installshield-error/installshield-error-1.php You can try these steps to fix this error:Close other running applications or restart your computer to free up memory.

I was initially dissappointed that the deployement didn't come with at least an initial set of merge modules already compiled for use, but then realized that they couldn't because the db If you want to keep Reporter 4 on this particular VM, as a workaround I would recommend to install it on another VM and after that create Veeam Reporter website manually Flag Permalink Reply This was helpful (0) Collapse - I understand that. Check for an updated version of the app.

And no one goes without backups. There is not much that I can do with this version until I can get the older project converted... Build a complete MSI file by selecting 'Build [1]' from the Build menu." [1] is a placeholder that contains the release name.

(add new tag) Adult Image? that means > (according to InstallShield documentation) that you are > trying to convert over a read-only application or the > application has read-only dependencies.

In order to get everything working on my end, I had to use the article http://www.sybase.com/detail?id=1027674 which walks you through deployment without Installshield. Mostly, you may experience program lock-ups, slow PC performance, system freezes, blue screen errors, startup or shutdown problems, and installation errors. Thank you. Worse yet, if you copied it to the desktop then the user's account would lock up on log in.I thought it was a fine thing to carry with me to a

my computer has always been good. The error happened once.The PCs get backed up every night, so if I will do a restore in the afternoon there will be a bit of information lost as the users