Home > Installshield Error > Installshield Error 6645

Installshield Error 6645

Error: %2 Error Description: %3 Check the Knowledge Base for information about this error, or request technical support. -6641 Internal build error. Check the Knowledge Base for information about this error, or request technical support. -6613 Internal build error. Workaround: Right click in the script editor pane, select properties, and go to the Language/Tabs tab. Cause: The Developer IDE escapes the square brackets, so [!filekey] becomes [\[]!filekey[\]] in the registry table. http://colvertgroup.com/installshield-error/installshield-error-105.php

To resolve this issue, do one of the following: • Schedule the InstallScript custom action for the Execute sequence. • Use InstallScript event–driven code instead of an InstallScript custom action. -7117 Error: 0 Error Description: ISEXP : error -6645: C:\WINDOWS\system32\user32.dll failed to load. But only if the file is located on the network. I can't believe it, Thank you!!!” Mohammed- Yesterday “I spent all day trying to sort this out then found your site.

Check the Knowledge Base for information about this error, or request technical support. -6604 Internal build error. The filenames themselves do not lend themselves to sorting in Windows Explorer, or from any other file-level tool, due to month-day-year date format, 12-hour time format, and lack of leading zeroes To resolve this error, select the appropriate type of file for the specified custom action in the Custom Actions and Sequences view (or the Custom Actions view). -7083 Script '%s' is

Status: InstallShield has confirmed that this is a problem in ISD 7.02 - 8.02 and DevStudio 9.00. Zero byte files are not supported in mobile installations. Suite/Advanced UI Projects. -7294 An Advanced UI project can include only one language. Do not run the action on an uninstallation. (?ComponentName=3) AND NOT($ComponentName=2) • If the custom action is sequenced after InstallFiles—Run the action only if the component will be installed locally. ($ComponentName=3)

InstallShield is unaware of anyone who has gotten it to work for Basic MSI either. For more information, see Adding .NET Framework Redistributables to Projects. -7023 Internal build error. Created: 2001-08-18 Last update: 2002-06-06 InstallShield tracking number: 1-6CFGR Dialog Box When Double-Clicking an Advertised Shortcut Description: Activating an advertised shortcut that was created using a Standard setup results in a Loading File table Building File table ISEXP : error -6645: C:\Program Files\Microsoft SQL Server\80\Tools\Binn\SQLDMO.dll failed to load.

Created: 2001-08-18 Last update: 2001-12-19 InstallShield tracking number: 1-68I6V News Discussions Windows Installer Related Tools More Help InstallScript About InstallSite Shop Site Search Neuigkeiten Diskussionsgruppen Windows Installer MSI Check the Knowledge Base for information about this error, or request technical support. -7057 You have enabled FlexNet Connect for this deployment, however, you have not provided a URL to check Cause: This error message is caused by a problem with the new COM extraction mechanism in ISD 7.02. To correct this issue, change one of the file keys to be unique in the cabinet file if you are building a compressed setup or a merge module.

Maybe there a special option for the standalone builder ? http://pcrepairpro13.com/installshield-error-6645.php How Did I Get This Error? bryanwolf01-17-2006, 05:31 PMYou would actually need to specifiy this for each file in your project. Bryan, are you with MacroVision?

Please check that the proper disk is inserted or specify a new path. news Not fixed in ISD 7.01 - 8.02 and DevStudio 9.00. This setting must have a value; otherwise, the text file changes are not made at run time. Reply With Quote 12-21-2005,12:19 AM #3 bostonmace View Profile View Forum Posts New User (0 Posts) Join Date Dec 2005 Posts 1 Same problem here as well.

  1. This error occurs if your project includes a DIM reference, as shown in the DIM References view, but InstallShield cannot find the DIM project file (.dim).
  2. Macrovision!!!
  3. If you try to build an uncompressed release in evaluation mode, the uncompressed option is ignored, and InstallShield displays this build warning.
  4. If the path does not have write access, INSTALLDIR is changed to the default path directory for INSTALLDIR (which by default is Program Files\Your Company Name\Your Product Name).
  5. To resolve this build warning, switch from an .spc file and a .pvk file to a .pfx file.
  6. If you call a function in a standard DLL that is installed with the product and the action is scheduled as deferred, the DLL you are calling must be the component's

Create a Restore Point first. #8 reghakr, Jun 3, 2009 Carpz New MemberJoined:Jun 1, 2009Messages:14Likes Received:0 I dont have any current driver, unless the High Definition Audio device or whatever is Status: InstallShield confirmed that this is a problem in ISD 7.03 - 8.02 and DevStudio 9.00. Why would this be occuring. have a peek at these guys Modifying a referenced MSI package of a Quick Patch, invalidates all Quick Patches that reference that MSI package.

If the target is on a network share, log in to the network. Created: 2001-09-15 InstallShield tracking number: n/a Error 1918 while Installing ODBC Resources on Windows Me Description: When you try to install ODBC Resources on a clean Windows Me machine (which has Error: 0 Error Description: jessebagans01-30-2006, 12:36 PMJust to isolate my issue further, I removed the reference to the Interop.SQLDMO.dll file that was created when I added the reference to SQLDMO to

Error: 0 Error Description: Adding merge module 'MSDE 2000 Distributed Management Objects (DMO)' that is a dependency of component 'Interop.SQLDMO.dll' ISEXP : error -6645: C:\Program Files\Vale Software\SQL Documentor\Binn\sqldmo.dll failed to load.

Select some other view, then return to your custom action The properties of the action will no longer be displayed in the rightmost pane, and you can't open the context menu Check the Knowledge Base for information about this error, or request technical support. -7120 Error building table %1 Check the Knowledge Base for information about this error, or request technical support. Check the Knowledge Base for information about this error, or request technical support. -7051 Internal build error. The invalid data in this example is the use of a single backslash instead of two backslashes.

If so, right-clcik on it and choose uninstall. #10 reghakr, Jun 3, 2009 Carpz New MemberJoined:Jun 1, 2009Messages:14Likes Received:0 I did that, restarted and windows automatically reinstalled the driver when i Error: 0 Error Description: This error appears for a long list of system dll's. Check the Knowledge Base for information about this error, or request technical support. -6596 An error occurred while attempting to sequence the action %1 in the upgraded image. http://colvertgroup.com/installshield-error/installshield-error-1.php Check the Knowledge Base for information about this error, or request technical support. -6599 An error occurred while creating the standard QuickPatch actions to the upgraded image.

Status: InstallShield has listed this problem as open issue in the release notes for ISD 7.00. If you do want to include the specified run-time language in your release, add the language to the Setup Languages setting. -7187 The Find What setting for the %1 text replacement Check the Knowledge Base for information about this error, or request technical support. -6580 An error occurred while generating a sub feature for feature %1. The Tools -> Options method does not alter this project, but only future projects.

InstallShield automatically applies the large package schema. Check the Knowledge Base for information about this error, or request technical support. -6578 An error occurred while synchronizing shortcuts from component '%1' while creating the upgraded image. In Table %1 Row %2, data files differ in the following columns: %3. this file can be found on the Crystal Reports 8/8.5 CD.

Status: InstallShield has confirmed that this issue still exists in ISDev 8.02 and DevStudio 9.00. The feature will properly removed. Required fields are marked *Comment Name * Email * Website Links Die eigene automatische Cloud Große Dateien senden Homepage erstellen IBAN-Rechner Impressum SEO Göppingen Sharepoint Stuttgart Techmeme River Test Management Software To display a splash screen, you must specify a valid bitmap file.

Last Jump to page: Results 1 to 5 of 21 Thread: Error 6645 Error: 0 Thread Tools Show Printable Version Subscribe to this Thread… Display Linear Mode Switch to Hybrid Mode This warning appears if your installation package contains more than 32,767 files. Status: InstallShield has listed this problem as open issue in the release notes for ISD 7.0.