Home > Internal Compiler > Internal Compiler Error In Gfc_typenode_for_spec

Internal Compiler Error In Gfc_typenode_for_spec

The PL/I attribute is ENTRY which is confusingly named for different reasons. (There are ENTRY variables which store the value of an ENTRY address. kottinge at utk dot edu [Bug fortran/69064] Unhelpful error message... It tends to accidentally work if the address is passed through. For 4.3.x only regression fixes are allowed. http://colvertgroup.com/internal-compiler/internal-compiler-error-cl-exe.php

Comment 3 Jerry DeLisle 2008-01-27 19:33:46 UTC I get no regressions with the fix in comment #2. URL: Previous message: [molpro-user] spin orbit error and compile error. VC++ 8 B1 :: Strange compiler behavior when compiling intrinsic functions 8. Please feel free to tell me I'm all wet on this...it's been a long time since I had to consider the problem. [...] OTOH, the reference to "F(A)" above unambigously tells https://gcc.gnu.org/bugzilla/show_bug.cgi?id=43539

Next message: [molpro-user] Question regarding paper "The Electronic Ground State of [Fe(CO)3(NO)]- A Spectroscopic and Theoretical Study" Messages sorted by: [ date ] [ thread ] [ subject ] [ author Why I have internal compiler error on definition of template function? 14. Compiler info: GNU Fortran2008 (GCC) version 5.3.0 (x86_64-unknown-linux-gnu) compiled by GNU C version 5.3.0, GMP version 4.3.2, MPFR version 2.4.2, MPC version 0.8.1 Error message and compile command: gcc -I/usr/lib/openmpi/include -pthread Looking for data to run the WRF?

  1. With gfortran 6 I get: ~$ gfortran-6 -c somemod.f90 somemod.f90:4:0: subroutine output() internal compiler error: in gfc_typenode_for_spec, at fortran/trans-types.c:1064 Please submit a full bug report, with preprocessed source if appropriate.
  2. Added: trunk/gcc/testsuite/gfortran.dg/array_constructor_22.f90 Modified: trunk/gcc/testsuite/ChangeLog Comment 6 Jerry DeLisle 2008-01-27 19:56:25 UTC Fixed on trunk Comment 7 Daniel Franke 2008-01-30 20:27:24 UTC *** Bug 34897 has been marked as a duplicate of
  3. I know this is very much N00b thing, I know that I didn't install any gfortran modules.

Although we aim to fix as many bugs as possible during every release's lifetime, sometimes those efforts are overtaken by events. Bug43539 - internal compiler error: in gfc_typenode_for_spec, at fortran/trans-types.c:995 Summary: internal compiler error: in gfc_typenode_for_spec, at fortran/trans-types.c:995 Status: RESOLVED DUPLICATE of bug 40728 Alias: None Product: gcc Classification: Unclassified Component: fortran Knowles, 1987 > > > > ****************************** > > *** Spin-orbit calculation *** > > ****************************** > > > > Spin-orbit matrix elements > > ========================== > > > Preparing effective Internal compiler error - vc compiler bug or faulty code? 11 post • Page:1 of 1 All times are UTC Board index Spam Report Home Reading Searching Subscribe Sponsors Statistics Posting

GCC Bugzilla – Bug43539 internal compiler error: in gfc_typenode_for_spec, at fortran/trans-types.c:995 Last modified: 2010-05-07 18:12:55 UTC Home | New | Browse | Search | [?] | Reports | Help | NewAccount Please include the complete backtrace with any bug report. Description Dominique d'Humieres 2008-01-27 17:22:17 UTC I have wrongly reported this regression under PR34848: pr33998.f90 started to fail after rev. 131676 and pr34897.f90 after rev. 131679. https://gcc.gnu.org/ml/gcc-bugs/2016-02/msg02472.html I've tried with the following versions of gfortran/gcc: gcc version 4.0.2 20051125 (Red Hat 4.0.2-8) gcc version 4.1.2 20070502 (Red Hat 4.1.2-12) gcc version 4.1.2 20070925 (Red Hat 4.1.2-33) (The line

Fatal Error: Can't open module file 'global_data.mod' for reading at (1): No such file or directory. The initial code (which is much more involved than the -|above) was written as Fortran77 which is why we're still using g77 -|sometimes. -| -|If I try to use gfortran (versions System and compiler information follows: ~$ lsb_release -rd && gfortran-5 -v && gfortran-6 -v Description: Debian GNU/Linux testing-updates (sid) Release: testing-updates Using built-in specs. Comment 9 Robert McBroom 2011-11-27 20:47:56 EST Tobias The attachment has the alternate paths for many alternate systems preprocessed out per submission outline while the error number of the output refers

df 0 0 > 0 0 > > 5 5553 5410. 219. http://forum.wrfforum.com/viewtopic.php?f=5&t=2066 kottinge at utk dot edu Reply via email to Search the site The Mail Archive home gcc-bugs - all messages gcc-bugs - about the list Expand Previous message Next message The I tried to reproduce the issue and I failed; I couldn't use the full example as the file providing "global_parameters" is not attached, but it is needed by the most examples. EXTERNAL CTRLC_AST LOGICAL first_call DATA first_call/.TRUE./ !kob 12/96 * ************************ UNIX ****************************** INTEGER SIGNAL, old_handler, sigint * (see 1 man signal or the include file < signal.h >) PARAMETER ( sigint

System compilation is fine for CENTOS 5.3 and CENTOS 6.0 with versions 4.3.2-7.el5 and 4.4.4-13.el6 of the compilers along with glibc 2.5-34.el5 and 2.12-1.7.el6 respectively. http://colvertgroup.com/internal-compiler/internal-compiler-error-gcc.php File attached. -- System Information: Debian Release: 6.0.1 APT prefers stable APT policy: (500, 'stable') Architecture: powerpc (ppc) Kernel: Linux 2.6.18-3-powerpc Locale: LANG=C, LC_CTYPE=C (charmap=ANSI_X3.4-1968) Shell: /bin/sh linked to /bin/bash Versions If I try to use gfortran (versions given below) then I get an error message which looks like: test2.for: In function 'MAIN__': test2.for:14: internal compiler error: in gfc_typenode_for_spec, at fortran/trans-types.c:636 Please Whereas 4.4.0 is the developer version, which can change every minute and will presumably be released next year. (The developer releases are quite stable and contain new features (OpenMP 3.0, some

The user also understands that NOAA/PMEL/TMAP * is not obligated to provide the user with any support, consulting, * training or assistance of any kind with regard to the use, operation kottinge at utk dot edu [Bug fortran/69064] Unhelpful error message... Comment 4 Jerry DeLisle 2008-01-27 19:39:43 UTC Subject: Bug 34990 Author: jvdelisle Date: Sun Jan 27 19:38:59 2008 New Revision: 131890 URL: http://gcc.gnu.org/viewcvs?root=gcc&view=rev&rev=131890 Log: 2008-01-27 Jerry DeLisle PR fortran/34990 * news kottinge at utk dot edu [Bug fortran/69064] Unhelpful error message...

Jan Top Internal compiler error when both using and passing an intrinsic function by Ken.Fairfi » Thu, 19 Jun 2008 01:57:42 On Jun 17, 5:57 am, Jan Vorbrgen I looked -|at http://www.yqcomputer.com/ #news and didn't see anything which -|suggests that the issue has been addressed in versions 4.2, 4.3 or 4.4. -| -|Interestingly, if I comment out either LINE I did compile the compiler from scratch, which I haven't done before so I could have messed something up there, but the only option I used was something that turned off

This is one case where it definitely should have EXTERNAL. -- glen Top Internal compiler error when both using and passing an intrinsic function by Allan Whit »

Bug Reporter: Thank you for reporting this issue and we are sorry that we were unable to fix it before Fedora 15 reached end of life. Confusingly, it could be used with an ENTRY statement name, but also works with the primary entry point.) Not quite as bad as C did with the static attribute. (With at Looks like there is some change in the expected arguments for the system functions signal and pttyin in the latest compilers. See for instructions.

See ../../../v270/src/mcnpx/mcnpf/ttyint.F: In function ‘ttyint’: > ../../../v270/src/mcnpx/mcnpf/ttyint.F:20:0: internal compiler error: in > gfc_typenode_for_spec, at fortran/trans-types.c:1019 The error message states that the error occurs in line determine so matrix > > > !{ci; > hlsmat,ls,3011.1,3021.1,3031.1,3051.1; option,matel=1;print,hls=0} > > {ci; hlsmat,ls,4011.1,4021.1,4031.1,4051.1; option,matel=1;print,hls=0} > > > > Variables initialized (778), CPU time= 0.01 sec > > Commands initialized (547), http://colvertgroup.com/internal-compiler/internal-compiler-error-net.php Please include the complete backtrace with any bug report.

Often a more recent Fedora release includes newer upstream software that fixes bugs or makes them obsolete. Comment 1 Dominique d'Humieres 2010-03-26 20:35:04 UTC Reduced test program sizetest1 use ISO_C_BINDING implicit none type contains_pointer integer data type(contains_pointer), pointer :: next end type contains_pointer type(contains_pointer) sp write(*,'(a,i0)') 'In f08: The problem only occurs if I both use the intrinsic -|function DLOG and pass it to another subroutine in the same program (it -|also occurs if the main program here is You'd still have to use dsqrt or dsin as an actual argument for double precision, csqrt or csin for default complex, and there seems to be no way to get an

Skip Knoble -|See

df 0 0 > 0 0 > > 3 5552 4753. 219. Used DATA rather than PARAMETER * statement because variable modified later in routine * - put a ! SIZEOF seems to be properly registered in intrinsic.c: add_sym_1 ("sizeof", GFC_ISYM_SIZEOF, NO_CLASS, ACTUAL_NO, BT_INTEGER, ii, GFC_STD_GNU, gfc_check_sizeof, NULL, NULL, x, BT_UNKNOWN, 0, REQUIRED); make_generic ("sizeof", GFC_ISYM_SIZEOF, GFC_STD_GNU); make_alias ("c_sizeof", GFC_STD_F2008); Could Fortran 66, 7.1.2.5: "...

Matlab compiler: Internal Error: Difficulty propagating the result id in a function body...possible answer. 11. I get the same error at line 904 with gfortran 4.4.2. f03 way: write(*,'(a,i0)') 'In f03: ', & transfer(C_LOC(ap(2)),1_C_INTPTR_T)- & transfer(C_LOC(ap(1)),1_C_INTPTR_T) ! make[2]: *** [mcnpf/ttyint.o] Error 1 make[2]: Leaving directory `/Work/mcnpx/v270.g/src/mcnpx' make[1]: *** [mcnpx] Error 2 make[1]: Leaving directory `/Work/mcnpx/v270.g/src' make: *** [mcnpx] Error 2 Version-Release number of selected component (if applicable): gcc.x86_64

COLLECT_GCC=gfortran-6 COLLECT_LTO_WRAPPER=/usr/lib/gcc-snapshot/libexec/gcc/x86_64-linux-gnu/6.0.0/lto-wrapper Target: x86_64-linux-gnu Configured with: ../src/configure -v --with-pkgversion='Debian 20160125-1' --with-bugurl=file:///usr/share/doc/gcc-snapshot/README.Bugs --enable-languages=c,ada,c++,java,go,fortran,objc,obj-c++ --prefix=/usr/lib/gcc-snapshot --enable-shared --enable-linker-build-id --disable-nls --with-sysroot=/ --enable-clocale=gnu --enable-libstdcxx-debug --enable-libstdcxx-time=yes --with-default-libstdcxx-abi=new --enable-gnu-unique-object --disable-vtable-verify --enable-libmpx --enable-plugin --with-system-zlib --disable-browser-plugin --enable-java-awt=gtk --enable-gtk-cairo --with-java-home=/usr/lib/jvm/java-1.5.0-gcj-6-snap-amd64/jre --enable-java-home

Get Social