Home > Internal Compiler > Internal Compiler Error In Lower_stmt At Gimple-low.c

Internal Compiler Error In Lower_stmt At Gimple-low.c

This was caused because apple's GCC has broken support for OpenMP. Modified: trunk/gcc/cp/ChangeLog trunk/gcc/cp/init.c trunk/gcc/testsuite/ChangeLog trunk/gcc/testsuite/g++.dg/ext/complit12.C Comment 12 Jason Merrill 2009-08-06 17:22:40 UTC Subject: Bug 40948 Author: jason Date: Thu Aug 6 17:22:19 2009 New Revision: 150533 URL: http://gcc.gnu.org/viewcvs?root=gcc&view=rev&rev=150533 Log: PR c++/40948 Now, here's the compiler/make output: [email protected]:~/src/graph-tool-2.2.15$ make make all-recursive Making all in src Making all in graph Making all in centrality CXX graph_betweenness.lo CXX graph_centrality_bind.lo CXX argh!) Sadly, the plot thickens. news

Unfortunately, scipy is compiled with compilers that cannot produce universal variants. Hence you should try something like:     ./configure CXXFLAGS="-arch i386 -arch x86_64 -I/opt/local/include" <..your other options..> I hope it helps. Thanks any help you can provide. org> Date: 2008-05-14 21:11:53 Message-ID: 20080514211153.31452.qmail () sourceware !

Comment 6 Jakub Jelinek 2009-08-03 12:07:22 UTC ctor initializer isn't needed, this ICEs as well: struct M { M () {} ~M () {} }; void foo () { M m[1] If you can reproduce this bug against a currently maintained version of Fedora please feel free to reopen this bug against that version. net [Download message RAW] This code is giving me an ICE: #include #include void parse() { typedef int (*optfunc)(); std::map helper; int taken = helper[""](); } g++ --save-temps

Maybe you should try the regular (non-llvm) g++? > I noticed that gcc 4.4 is required for compilation. Comment 5 Jakub Jelinek 2008-05-23 13:22:34 UTC Subject: Bug 36237 Author: jakub Date: Fri May 23 13:21:47 2008 New Revision: 135802 URL: http://gcc.gnu.org/viewcvs?root=gcc&view=rev&rev=135802 Log: PR c++/36237 * cp-gimplify.c (cxx_omp_clause_apply_fn): Call fold_build_cleanup_point_expr NAML Tiago Peixoto Reply | Threaded Open this post in threaded view ♦ ♦ | Report Content as Inappropriate ♦ ♦ Re: boost errors building on Mac OSX Administrator In I figure my next step will be to either a) make sure everything python is compiled for 64-bit; or b) switch back to linux and get it working in 5 minutes.

Comment 4 Silviu Ganceanu 2008-05-23 12:51:37 UTC (In reply to comment #3) > Note that your example is very buggy. sigh... See for instructions. Download in other formats: Comma-delimited Text Tab-delimited Text RSS Feed Red Hat Bugzilla – Bug452972 Internal compiler error with G++.

Apple's GCC version 4.2 without OpenMP compiles graph-tool without a problem. From the ./configure command you sent in the first email, it did not seem you passed this. Version: gcc (Gentoo 4.4.1 p1.0) 4.4.1 Comment 1 devurandom 2009-08-03 09:17:34 UTC Created attachment 18286 [details] TestClass source Comment 2 devurandom 2009-08-03 09:21:05 UTC Created attachment 18287 [details] TestClass preprocessed source The error message said that I should report it here.

  1. sigh...
  2. An internal compiler error is always a bug in the compiler...
  3. OpenMP and GSL RNG Last modified: 2009-01-20 16:25:08 EST Home | New | Search | [?] | Reports | Requests | Help | NewAccount | Log In [x] | Forgot Password
  4. It appears that multiple architectures are not supports with many compiler options(?): make  all-recursiveMaking all in srcMaking all in graphMaking all in centrality  CXX    graph_betweenness.lollvm-g++-4.2: -E, -S, -save-temps and -M
  5. Thanks any help you can provide.
  6. COLLECT_GCC=gcc COLLECT_LTO_WRAPPER=local/gcc5.1/lib/gcc/x86_64-unknown-linux-gnu/5.1.0/lto-wrapper Target: x86_64-unknown-linux-gnu Configured with: ../gcc-5.1.0/configure --prefix=local/gcc5.1 --enable-languages=c,c++,fortran --enable-gold=yes --enable-ld=yes --enable-lto --enable-bootstrap --disable-multilib Thread model: posix gcc version 5.1.0 (GCC) Follow-Ups: [Bug c++/66859] [cilk+] internal compiler error: in lower_stmt From:
  7. OpenMP and GSL RNG Summary: Internal compiler error with G++.
  8. I'd have to investigate further.
  9. Try again with the --disable-openmp option, and it should work. > Also, I attempted to install from macports originally.

Free forum by Nabble Edit this page [prev in list] [next in list] [prev in thread] [next in thread] List: gcc-bugs Subject: [Bug c++/36237] internal compiler error: in lower_stmt, at gimple-low.c:282 Fedora 8 is no longer maintained, which means that it will not receive any further security or bug fix updates. Actual results: test.cpp: In function ‘int main()’: test.cpp:0: internal compiler error: in lower_stmt, at gimple-low.c:231 Please submit a full bug report, with preprocessed source if appropriate. See for instructions.

Change History Changed 3 years ago by [email protected]… Attachment qt4-mac.leopard.ppc.main.log.bz2​ added comment:1 in reply to: ↑ description Changed 3 years ago by [email protected]… Replying to [email protected]…: I have not tested Leopard Intel http://colvertgroup.com/internal-compiler/internal-compiler-error-gcc.php Second bug is if (true == globalTodoStack.empty()) { outside of critical region, as globalTodoStack is shared, calling this is really racy, generally it could crash, in g++ as it just compares comment:3 Changed 3 years ago by [email protected]… Repeat of my question: Any recommendation on how to blacklist correctly for this issue? Bug Reporter: Thank you for reporting this issue and we are sorry that we may not be able to fix it before Fedora 8 is end of life.

Distilling a testcase. Maybe they can fix the scipy portfile to allow an universal build. I know that Mac > likes to tweak gcc. http://colvertgroup.com/internal-compiler/internal-compiler-error-net.php The error vanishes if the definition of TestClass::TestClass() is moved into the declaration of TestClass.

Summary: internal compiler error: in lower_stmt, at gimple-low.c:282 erase 'private(lo... The graph-tool build error is related to boost, which I installed using macports (version 1.47) . First of all, data sharing clauses on #pragma omp parallel only affect the uses of the variable within the construct, they have no effect on variables in other functions.

This report is therefore being closed with a resolution of ERRATA.

But I notice you are using llvm-g++. Comment 1 Silviu Ganceanu 2008-05-14 21:06:33 UTC Created attachment 15638 [details] Archive containing source code wich generated the bug, makefile and *.ii files. Description devurandom 2009-08-03 09:16:50 UTC testclass.cpp: In constructor ‘TestClass::TestClass()': testclass.cpp:13: internal compiler error: in lower_stmt, at gimple-low.c:408 Please tell me if you need more information. You may reopen this bug report if the solution does not work for you.

make[4]: *** [graph_motifs.lo] Error 1 make[3]: *** [all-recursive] Error 1 make[2]: *** [all-recursive] Error 1 make[1]: *** [all-recursive] Error 1 make: *** [all] Error 2 Also, I attempted to install from Cheers, Tiago -- Tiago de Paula Peixoto <[hidden email]> _______________________________________________ graph-tool mailing list [hidden email] http://lists.skewed.de/mailman/listinfo/graph-tool signature.asc (566 bytes) Download Attachment -- Tiago de Paula Peixoto jesse berwald Reply | NAML tcb-2 Reply | Threaded Open this post in threaded view ♦ ♦ | Report Content as Inappropriate ♦ ♦ Re: boost errors building on Mac OSX hi,You can build http://colvertgroup.com/internal-compiler/internal-compiler-error-cl-exe.php Bug452972 - Internal compiler error with G++.

Home | New | Search | [?] | Reports | Requests | Help | NewAccount | Log In [x] | Forgot Password Login: [x] | Report Bugzilla Bug Legal Red Hat Target: i486-linux-gnu Configured with: ../src/configure -v --enable-languages=c,c++,fortran,objc,obj-c++,treelang --prefix=/usr --enable-shared --with-system-zlib --libexecdir=/usr/lib --without-included-gettext --enable-threads=posix --enable-nls --with-gxx-include-dir=/usr/include/c++/4.2 --program-suffix=-4.2 --enable-clocale=gnu --enable-libstdcxx-debug --enable-objc-gc --enable-mpfr --enable-targets=all --enable-checking=release --build=i486-linux-gnu --host=i486-linux-gnu --target=i486-linux-gnu Thread model: posix gcc version 4.2.3 This probably came about due to MacPorts 2.2 which now uses gcc-4.2 as the default compiler on Leopard instead of gcc-4.0. Comment 4 Jakub Jelinek 2009-08-03 11:04:05 UTC Simplified testcase: struct M { M () {} ~M () {} }; struct S { S (); M m[1]; }; S::S () : m

But I notice you are using llvm-g++. Last modified: 2008-12-28 04:14:38 UTC Home | New | Browse | Search | [?] | Reports | Help | NewAccount | Log In Remember [x] | Forgot Password Login: [x] User Thanks. I figure my next step will be to either a) make sure everything python is compiled for 64-bit; or b) switch back to linux and get it working in 5 minutes.

Modified: branches/gcc-4_4-branch/gcc/cp/ChangeLog branches/gcc-4_4-branch/gcc/cp/init.c branches/gcc-4_4-branch/gcc/testsuite/ChangeLog branches/gcc-4_4-branch/gcc/testsuite/g++.dg/ext/complit12.C Comment 13 Andrew Pinski 2009-10-14 04:47:10 UTC Fixed. At this point I have reached a bit of a dead end. Compile provided test case with : g++ test.cpp -fopenmp 2. 3. An internal compiler error is always a bug in the compiler...

Added: trunk/gcc/testsuite/g++.dg/ext/complit12.C Modified: trunk/gcc/cp/ChangeLog trunk/gcc/cp/init.c trunk/gcc/testsuite/ChangeLog Comment 10 Jason Merrill 2009-08-04 02:26:51 UTC Subject: Bug 40948 Author: jason Date: Tue Aug 4 02:26:34 2009 New Revision: 150395 URL: http://gcc.gnu.org/viewcvs?root=gcc&view=rev&rev=150395 Log: PR Thanks any help you can provide.  Jesseps--I've submitted a bug report at macports concerning the scipy universal build problems. On Sun, Nov 27, 2011 at 12:37 PM, Tiago Peixoto [via Main discussion Note: See TracTickets for help on using tickets. Bug36237 - internal compiler error: in lower_stmt, at gimple-low.c:282 erase 'private(localTodoStack)' it compiles successfully.