Home > Internal Compiler > Internal Compiler Error In Pop_scope At C-decl.c

Internal Compiler Error In Pop_scope At C-decl.c

See for instructions. So wehre wud i find the compiler > sources? > That would be a waste of time. The time now is 07:23 PM. patching file drivers/acpi/Kconfig Hunk #1 succeeded at 257 with fuzz 1 (offset 38 lines). news

Can you try to bootstrap with a different compiler first. done. ==> CWD /pub/linux/kernel/v2.6 ... If you are having sporadic kernel/hardware failures, then you may be able to complete a build if you just keep typing "make bootstrap" enough times. Join our community today! https://gcc.gnu.org/bugzilla/show_bug.cgi?id=17118

The key thing to check is whether the bugs are reproducible. So wehre wud i find the compiler > sources? Nesting your stack calls properly means that it should not fail at run-time. Note that registered members see fewer ads, and ContentLink is completely disabled once you log in.

  1. Topics: Active | Unanswered Index »Kernel & Hardware »Ati with kernel26.
  2. Seriouly, how can I check my hardware ?
  3. Usually that's sign of a bad memory, overheated CPU or some other hardware problems.
  4. Having a problem logging in?
  5. Comment 5 Jean-Marc Vanel 2004-08-20 14:05:34 UTC Subject: Re: internal compiler error in pop_scope pinskia at gcc dot gnu dot org wrote: >------- Additional Comments From pinskia at gcc dot gnu
  6. Are you new to LinuxQuestions.org?
  7. time make bootstrap ....

What's at that line? cocoa xcode cocoa xcode strange x-code error Luigi Castelli strange x-code error Feb 06 2008, 23:47 Hi there, all of a sudden I started getting this error in xcode: internal compiler done.==> PASV ... IF YOU ARE NOT THE INTENDED RECIPIENT, CONTACT THE SENDER BY E-MAIL AT AND DESTROY ALL COPIES OF THE ORIGINAL MESSAGE.

Comment 2 Jean-Marc Vanel 2004-08-20 08:14:20 UTC Subject: Re: internal compiler error in pop_scope pinskia at gcc dot gnu dot org wrote: >------- Additional Comments From pinskia at gcc dot gnu Search. ar rc ./libgcc.a libgcc/./_muldi3.oS libgcc/./_negdi2.oS libgcc/./_lshrdi3.oS libgcc/./_ashldi3.oS libgcc/./_ashrdi3.oS libgcc/./_cmpdi2.oS libgcc/./_ucmpdi2.oS libgcc/./_floatdidf.oS libgcc/./_floatdisf.oS libgcc/./_fixunsdfsi.oS libgcc/./_fixunssfsi.oS libgcc/./_fixunsdfdi.oS libgcc/./_fixdfdi.oS libgcc/./_fixunssfdi.oS libgcc/./_fixsfdi.oS libgcc/./_fixxfdi.oS libgcc/./_fixunsxfdi.oS libgcc/./_floatdixf.oS libgcc/./_fixunsxfsi.oS libgcc/./_fixtfdi.oS libgcc/./_fixunstfdi.oS libgcc/./_floatditf.oS libgcc/./_clear_cache.oS libgcc/./_enable_execute_stack.oS libgcc/./_trampoline.oS libgcc/./__main.oS libgcc/./_absvsi2.oS libgcc/./_absvdi2.oS patching file arch/i386/kernel/acpi/sleep.c patching file arch/ia64/kernel/acpi.c patching file drivers/acpi/container.c patching file drivers/acpi/executer/exoparg2.c patching file drivers/acpi/fan.c patching file drivers/acpi/parser/psopcode.c patching file drivers/acpi/resources/rsaddr.c patching file drivers/acpi/resources/rscalc.c patching file drivers/acpi/resources/rsdump.c patching file drivers/acpi/resources/rslist.c patching

You are currently viewing LQ as a guest. Pada View Public Profile Send a private message to Pada Find all posts by Pada #3 23-10-2013, 15:48 dbauermann Junior Member Join Date: Oct 2013 Posts: 3 Hei Passed config ... Allright I try.

If you had the compiler sources you would > probably discover the report of the error in file "c-decl.c" on line > 840. > > Are you using templates? > > https://bugzilla.redhat.com/show_bug.cgi?id=198295 By joining our community you will have the ability to post topics, receive our newsletter, use the advanced search, subscribe to threads and access many other special features. Notices Welcome to LinuxQuestions.org, a friendly and active Linux Community. Comment 7 Jean-Marc Vanel 2004-08-20 16:40:11 UTC Subject: Re: internal compiler error in pop_scope pinskia at gcc dot gnu dot org wrote: >------- Additional Comments From pinskia at gcc dot gnu

make[3]: *** [libgcc/./_gcov_merge_add.o] Erreur 1 make[3]: Leaving directory `/usr/src/gcc-cvs/objdir/gcc' make[2]: *** [libgcc.a] Erreur 2 make[2]: Leaving directory `/usr/src/gcc-cvs/objdir/gcc' make[1]: *** [stage2_build] Erreur 2 make[1]: Leaving directory `/usr/src/gcc-cvs/objdir/gcc' make: *** [bootstrap-lean] Erreur http://colvertgroup.com/internal-compiler/internal-compiler-error-c.php I haven't tried what your doing but if you changed the .config file from what was orginally, ie cut and paste, replace, etc., then you will get that error. Format For Printing -XML -Clone This Bug -Top of page Home | New | Browse | Search | [?] | Reports | Help | NewAccount | Log In Remember [x] | If you type "make bootstrap" 3 times in a row, do you get the exact same failure every time?

connected.HTTP request sent, awaiting response... 200 OKLength: 3,343 [text/x-diff]100%[====================================>] 3,343 17.55K/s 22:46:07 (17.54 KB/s) - `nvidia_6111-6629_compat2.diff' saved [3343/3343]==> Downloading acpi-dsdt-initrd-patch-v0.7d-2.6.9.patch--22:46:07-- http://gaugusch.at/acpi-dsdt-initrd-pat … make[3]: *** [drivers/char/synclinkmp.o] Error1 make[2]: *** [drivers/char] Error 2 make[1]: *** [drivers] Error 2 make[1]: Leaving directory '/usr/src/linux-2.6.18.6' make: *** [stamp-build] Error 2 Mithrilhall View Public Profile View LQ Blog Its up to you to replace it with the old. More about the author For all (two) programs >> which I use stack operations ( glPushMatrix() and glPopMatrix() ), I >> get an error whcih says :- >> >> internal compiler error: in pop_scope, at

The other instructions emitted in that error message are basically "File a bug, with preprocessed source if possible." Chris Jean-Daniel Dupas Re: strange x-code error Feb 07 2008, 09:56 Le 7 And, for my surprise, the compile worked! done.==> TYPE I ...

done. ==> RETR linux-2.6.11.7.tar.bz2 ...

Maybe there is a linux FAQ about this somewhere? Laurence Harris Re: query in OpenGL Oct 11 2006, 18:14 On Oct 11, 2006, at 12:48 AM, Gargi wrote: > Hey, > > Surprisingly I did not have many people respond Hint :configure your browser Monospace font in the Preferences. Make simple changes and see whether the problem goes away.

If your sure its correct, do makepkg -g >>PKGBUILD. Offline #3 2005-04-29 21:32:57 T-Dawg Forum Fellow From: Wilmington, NC Registered: 2005-01-29 Posts: 2,734 Re: Ati with kernel26. Password Register FAQ Community Calendar Today's Posts Search Community Links Social Groups Pictures & Albums Members List Search Forums Show Threads Show Posts Tag Search Advanced Search Go to Page... click site I'm using Slackware 14.0.

make clean bzImage modules || return 1 mkdir -p $startdir/pkg/{lib/modules,boot} make INSTALL_MOD_PATH=$startdir/pkg modules_install || return 1 cp System.map $startdir/pkg/boot/System.map26 cp arch/i386/boot/bzImage $startdir/pkg/boot/vmlinuz26 install -D -m644 Makefile $startdir/pkg/usr/src/linux-${_kernver}/Makefile install -D Did you modify the config file? make[1]: *** [drivers/mtd/maps/netsc520.mod.o] Error 1 make: *** [modules] Error 2 I attempted to follow the instructions from: file:///usr/share/doc/HTML/index.html#id287544 Comment 1 Jakub Jelinek 2006-08-07 06:43:15 EDT This is not a GCC bug, The BIOS might have some memory testing stuff.

I'm glad you solved it by turning your PC off and on again ... See for instructions.