Home > Internal Compiler > Internal Compiler Error Segmentation Fault Gentoo

Internal Compiler Error Segmentation Fault Gentoo

and I know it is bad ram... They hope these examples will help you to get a better understanding of the Linux system and that you feel encouraged to try out things on your own. Join our community today! Executing that command from my home directory... check my blog

Johan Euphrosine (proppy) wrote on 2010-04-15: #18 [email protected]:/tmp$ wget http://launchpadlibrarian.net/44231243/osg-ice.tgz --2010-04-15 08:45:45-- http://launchpadlibrarian.net/44231243/osg-ice.tgz Resolving launchpadlibrarian.net..., Connecting to launchpadlibrarian.net||:80... Hide Permalink Scott Furry added a comment - 04/Feb/15 2:31 PM No. Privacy policy About Wikipedia Disclaimers Contact Wikipedia Developers Cookie statement Mobile view FAQ Forum Quick Links Unanswered Posts New Posts View Forum Leaders FAQ Contact an Admin Forum Community Forum Council would you have some clue where i can look at it ? https://forums.gentoo.org/viewtopic-t-947148-start-0.html

and I know it > is bad ram... See for instructions. If it's really not that, then it is most likely some semi-random bug. PHP Code: style="color: #0000BB">cathello.c

printf Finally i decided to compile the source myself. (#emerge gentoo-sources) when i #make in /usr/src/linux, the same error appears( No bug report genrated , must be ur hardware or OS problem.)

Always at the same location? > > If it segfaults randomly, try to check for bad memory. > > Christoph > -- > echo mailto: NOSPAM !#$.'<*>'|sed 's. ..'|tr "<*> !#:2" Related 2Is “my IDE crashed” question on-topic here?17Are questions about compiling/building third-party software off-topic for Stack Overflow?2Are questions about usability and user interface on topic?1Questions off-topic about VirtualMachine and command-line27Are questions Comment 13 Jakub Jelinek 2014-10-30 10:40:55 UTC GCC 4.9.2 has been released. An ICE generally looks like: somefile.c:1001: internal compiler error: Segmentation fault Please submit a full bug report, with preprocessed source if appropriate.

I've opened PR63306 for this issue. http://www.linuxquestions.org/questions/linux-newbie-8/gentoo-compilation-error-543435/ Show Arfrever Frehtes Taifersar Arahesis added a comment - 04/Feb/15 2:36 PM You might also test building with gcc 4.8.* and MAKEOPTS="-j7". Comment 19 Cary Coutant 2014-11-07 18:13:45 UTC I'm pretty sure that Pedro's proposed patch here -- https://gcc.gnu.org/ml/gcc-patches/2014-05/msg02279.html -- will fix this bug. See full activity log To post a comment you must log in.

Parse error, e.g.: somefile.cpp:24: parse error before `something'[2] This could mean that a semi-colon is missing at the end of the previous statement. click site Feeding it to multiple compilers (in the case of C++, one would likely use at least two of CLang, GCC, a recent MSVC, and/or some EDG frontended compiler such as ICC You can help Wikipedia by expanding it. gcc: 4:4.4.3-1ubuntu1 libc6: 2.11.1-0ubuntu5 $ git clone git://glean.git.sourceforge.net/gitroot/glean/glean $ cd glean $ scons -C src g++ -o glean/build/linux-x86-debug/glean/geomrend.o -c -O0 -g3 -m32 -Wall -Wmissing-field-initializers -Wpointer-arith -fmessage-length=0 -D__UNIX__ -D__X11__ -Iglh -Ilibs/dsurf -Ilibs/image

  • Apparently, it was taken care of in 4.2. (A Google search for the subject line of this thread should give you more info.) First I would figure out what gcc actually
  • I second the suggestion above -- check that the build-essential package is installed.
  • Recent example, Internal compiler error GCC-4.8.3 I feel that these questions are inherently duplicates of each other (similar to floating point questions about round-off errors.) However, the c# questions demonstrate that
  • You say you tried *emerging* genkernel...does that error generate during emerging the genkernel package (specifically), or while emerge is handling dependencies?
  • rakris View Public Profile View LQ Blog View Review Entries View HCL Entries Find More Posts by rakris 04-07-2007, 12:11 PM #9 Emerson LQ Guru Registered: Nov 2004 Location:
  • openscenegraph just built fine yesterday: https://edge.launchpad.net/ubuntu/+source/openscenegraph/2.8.1-1.1build1 Cedric Pinson (cedric-pinson) wrote on 2010-04-13: #6 preprecessed file OpenSceneGraph-2.8.3/src/osg/AlphaFunc.cpp Edit (692.6 KiB, text/plain) Matthias Klose (doko) wrote on 2010-04-13: #7 Building the attached source

I did not try OpenSceneGraph. Description David Kredba 2014-09-12 16:29:10 UTC Created attachment 33481 [details] Preprocessed un-reduced file Part of media-libs/mesa-10.2.7 Gentoo package segfaults cc1plus: x86_64-pc-linux-gnu-g++ -m32 -DPACKAGE_NAME=\"Mesa\" -DPACKAGE_TARNAME=\"mesa\" -DPACKAGE_VERSION=\"10.2.7\" "-DPACKAGE_STRING=\"Mesa 10.2.7\"" "-DPACKAGE_BUGREPORT=\"https://bugs.freedesktop.org/enter_bug.cgi?product=Mesa\"" -DPACKAGE_URL=\"\" -DPACKAGE=\"mesa\" -DVERSION=\"10.2.7\" The log itself says, that it isn't reproducible (means the crash is for everyone in some file and then stable at the same point). news please do so.

Os> class adaptor_range : detail::basic_range< adaptor_range, detail::iterator_adaptor...>, detail::iterator_adaptor...>> {}; template using property_list = std::A; class B { B(const property_list& p1, const adaptor_range& p2); }; B::B(const ::property_list& p1, const adaptor_rangeJohan Euphrosine (proppy) wrote on 2010-04-13: #12 Oups, launchpad scrambled my comments.

suggests to try building with a vanilly kernel. Hide Permalink Arfrever Frehtes Taifersar Arahesis added a comment - 04/Feb/15 2:27 PM There is currently no proof that this error is caused by any problem in build system of LibreOffice. Please post your machine specs if you can reproduce this bug (and post if you can't with gcc 4.4.3 ) Cedric Pinson (cedric-pinson) wrote on 2010-04-15: #24 Cedric's machine: model name: Vinson Lee (vlee) wrote on 2010-04-17: #35 I am running 32-bit Lucid on Intel Core i7 CPU 920 and am also seeing a GCC ICE.

Code: $ ldd gcc ldd: ./gcc: No such file or directory what does "catchsegv gcc" show? make[2]: *** [all-recursive] Error 1 make[1]: *** [all] Error 2 make: *** [all-recursive] Error 1 !!! Edit: In case you have repeatable segfaults then the source is buggy or corrupted, run emerge --sync and try again. More about the author Linux user #433000|Ubuntu user #8750 Adv Reply February 4th, 2009 #5 iharrold View Profile View Forum Posts Private Message A Carafe of Ubuntu Join Date Nov 2007 Beans 88 DistroUbuntu

Where the site between the angle brackets is the generic bug tracker for one's system, although I feel it's more appropriate for example to link to the compiler's bug reporting procedure My hardware is lenovo w510 with icore 7 820Q dont know if it's related or not with hardware, any idea will be appreciated Johan Euphrosine (proppy) wrote on 2010-04-14: #14 After Registration is quick, simple and absolutely free. Hot Network Questions horizontal alignment of equations across multiple lines Word for destroying someone's heart physically How to DM a no-equipment start when one character needs something specific?

I also tried using --pretend option to know its USE flags an updated USE variable in /etc/make.conf .

Get Social