Home > Internal Compiler > Internal Compiler Error Segmentation Fault Program Cc1plus

Internal Compiler Error Segmentation Fault Program Cc1plus

Contents

Hiring manager invited me to visit while emphasizing that there is not an open position more hot questions question feed lang-cpp about us tour help blog chat data legal privacy policy But g++ 4.0.1 and 4.2.1 do work. gcc-4.2 -v programs/c/lib*/hello.c Using built-in specs. COLLECT_GCC=g++-4 COLLECT_LTO_WRAPPER=/sw/lib/gcc4.5/libexec/gcc/i386-apple-darwin10.7.0/4.5.2/lto-wrapper Target: i386-apple-darwin10.7.0 Configured with: ../gcc-4.5.2/configure --prefix=/sw --prefix=/sw/lib/gcc4.5 --mandir=/sw/share/man --infodir=/sw/lib/gcc4.5/info --enable-languages=c,c++,fortran,objc,obj-c++,java --with-gmp=/sw --with-libiconv-prefix=/sw --with-ppl=/sw --with-cloog=/sw --with-mpc=/sw --with-system-zlib --x-includes=/usr/X11R6/include --x-libraries=/usr/X11R6/lib --program-suffix=-fsf-4.5 Thread model: posix gcc version 4.5.2 (GCC) COLLECT_GCC_OPTIONS='-mmacosx-version-min=10.6.7' '-v' '-o' http://colvertgroup.com/internal-compiler/internal-compiler-error-killed-program-cc1plus.php

sudo aptitude purge gcc-4.3 sudo aptitude install gcc-4.3 navneethFebruary 6th, 2009, 04:04 PMI find it odd that gcc-4.3 would segfault. There is NO warranty; not even for MERCHANTABILITY or FITNESS FOR A PARTICULAR PURPOSE. Status:ClosedPriority:NormalAssignee:Yi HuangCategory:BuildTarget version:v0.3Start date:11/09/2014Due date:% Done:100% Description Build error on Ubuntu 14.10. Powered by Redmine © 2006-2016 Jean-Philippe Lang Wednesday, October 19, 2016 Latest: Convert JavaScript Date object to YYYYMMDD format How to Disable Back Button Press in Android Git - Undo Uncommitted https://gcc.gnu.org/bugzilla/show_bug.cgi?id=49351

C++: Internal Compiler Error: Segmentation Fault (program Cc1plus) Opencv

I have never had this happen to me before. navneethFebruary 4th, 2009, 09:35 AMThanks for the replies. I use Ubuntu 8.10. GGC heuristics: --param ggc-min-expand=79 --param ggc-min-heapsize=92648 Compiler executable checksum: 701f49e7293d34991318670b7ec675ac programs/c/lib_example/hello.c:1:19: error: stdio.h: No such file or directory programs/c/lib_example/hello.c: In function main: programs/c/lib_example/hello.c:5: warning: incompatible implicit declaration of built-in function printf

Purging and re-installing didn't work, either. :( (For those who might be facing the problem and trying the above solution: you may need to install build-essential separately after the second step.) build-essential and libc6-dev are installed and the latest versions. obviously it would be good if gcc didn't use so much memory, but I did verify that given a sufficiently beefy machine (64-bit, 24GB RAM) gcc 4.5.2 can compile the .ii, So I guess g++ is exceeding the stack limit and crashing, not the heap memory. $ ulimit -aH core file size (blocks, -c) 0 data seg size (kbytes, -d) unlimited file

We recommend upgrading to the latest Safari, Google Chrome, or Firefox. Gcc Word for destroying someone's heart physically Why aren't sessions exclusive to an IP address? Your Answer draft saved draft discarded Sign up or log in Sign up using Google Sign up using Facebook Sign up using Email and Password Post as a guest Name https://redmine.named-data.net/issues/2171 Lunacy - what does it mean?

Not the answer you're looking for? share|improve this answer answered Jun 26 '13 at 14:49 gertvdijk 38.1k1598173 The version need to be the same as the installed cc1. Apparently, it was taken care of in 4.2. (A Google search for the subject line of this thread should give you more info.) First I would figure out what gcc actually If int doesn't help try posting your env env navneethFebruary 4th, 2009, 09:16 PMAll of the following commands were executed from the home directory.

Gcc

All rights reserved.Theme: ColorMag by ThemeGrill. Discover More On the other hand, it doesn't seem to be memory related. C++: Internal Compiler Error: Segmentation Fault (program Cc1plus) Opencv You signed out in another tab or window. If I were you, I would try to remove the build-essential, reboot.

I am unable to reproduce this using the exact same gcc version and the source you provided - binary returns "Hello World!" as expected. navigate to this website Now I get this message when I try to compile: gcc: internal compiler error: Segmentation fault (program cc1) Compiling the same program with g++ works fine. I'm trying to remember if something I had done has resulted in this, but nothing pops up. malloc does not cause OS to allocate physical memory until a page is touched, so it shouldn't be used.

neomilium commented Oct 9, 2013 As I didn't find a way to attach the whole log file, I give more about error context here: make[4]: Entering directory `/home/buildbot/mxe/tmp-qt/qt-everywhere-opensource-src-4.8.5/src/winmain' i686-pc-mingw32-g++ -c -pipe with current gcc 4.8.2 and ubuntu 13.10 everything worked fine. $> i686-pc-mingw32-g++ --version i686-pc-mingw32-g++ (GCC) 4.8.2 Copyright (C) 2013 Free Software Foundation, Inc. I'd try it right now, but it's getting late here, and I'll be going to bed in the next few minutes. More about the author Target: i486-linux-gnu Configured with: ../src/configure -v --with-pkgversion='Ubuntu 4.3.2-1ubuntu12' --with-bugurl=file:///usr/share/doc/gcc-4.3/README.Bugs --enable-languages=c,c++,fortran,objc,obj-c++ --prefix=/usr --enable-shared --with-system-zlib --libexecdir=/usr/lib --without-included-gettext --enable-threads=posix --enable-nls --with-gxx-include-dir=/usr/include/c++/4.3 --program-suffix=-4.3 --enable-clocale=gnu --enable-libstdcxx-debug --enable-objc-gc --enable-mpfr --enable-targets=all --enable-checking=release --build=i486-linux-gnu --host=i486-linux-gnu --target=i486-linux-gnu Thread model: posix

Why does Mal change his mind? Thank you so much. I've yet to try removing and installing build-install.

Try reverting the symbolic link you created and reinstall that package. –gertvdijk Jun 26 '13 at 11:18 | show 3 more comments 1 Answer 1 active oldest votes up vote 4

  1. When trying to generate the preprocessed source, the same crash occurs. $ gcc -v Using built-in specs.
  2. Join them; it only takes a minute: Sign up c++: internal compiler error: Segmentation fault (program cc1plus) up vote 0 down vote favorite I want to install opencv on raspberry pi3
  3. As it did not help, here is the output of apt-cache policy gcc-4.6: gcc-4.6: Installed: 4.6.3-1ubuntu5 Candidate: 4.6.3-1ubuntu5 Version table: *** 4.6.3-1ubuntu5 0 500 http://il.archive.ubuntu.com/ubuntu/ precise/main amd64 Packages 100 /var/lib/dpkg/status and
  4. How should I deal with a difficult group and a DM that doesn't help? 기계 (gigye) ==> 機械, 器械, 奇計 (what else?) What could make an area of land be accessible
  5. One of the Ubuntu 8.10 amd64 systems I admin had this very same issue.
  6. Running: make qt fails with following error (from log/qt file): i686-pc-mingw32-g++: internal compiler error: Segmentation fault (program cc1plus) 0x8053987 execute /home/buildbot/mxe/tmp-gcc/gcc-4.8.1/gcc/gcc.c:2823 First, I think that was caused by memory lacking like
  7. Well, they don't actually compile this .ii file (I get errors regarding some stl calls, things in the std namespace, and such), but they both compile the original source code without

Could you please tell me how to do that? make[4]: *** [.obj/release-static/qabstractanimation.o] Error 4 make[4]: Leaving directory `/home/buildbot/mxe/tmp-qt/qt-everywhere-opensource-src-4.8.5/src/corelib' make[3]: *** [release] Error 2 make[3]: Leaving directory `/home/buildbot/mxe/tmp-qt/qt-everywhere-opensource-src-4.8.5/src/corelib' make[2]: *** [sub-corelib-make_default-ordered] Error 2 make[2]: Leaving directory `/home/buildbot/mxe/tmp-qt/qt-everywhere-opensource-src-4.8.5' make[1]: *** [build-only-qt_i686-pc-mingw32] Error Target: i386-apple-darwin10.7.0 Configured with: ../gcc-4.5.2/configure --prefix=/sw --prefix=/sw/lib/gcc4.5 --mandir=/sw/share/man --infodir=/sw/lib/gcc4.5/info --enable-languages=c,c++,fortran,objc,obj-c++,java --with-gmp=/sw --with-libiconv-prefix=/sw --with-ppl=/sw --with-cloog=/sw --with-mpc=/sw --with-system-zlib --x-includes=/usr/X11R6/include --x-libraries=/usr/X11R6/lib --program-suffix=-fsf-4.5 Thread model: posix gcc version 4.5.2 (GCC) COLLECT_GCC_OPTIONS='-mmacosx-version-min=10.6.7' '-v' '-fversion' '-shared-libgcc' '-mtune=generic' and install it again.

GNU C version 4.1.3 20080623 (prerelease) (Ubuntu 4.1.2-23ubuntu3) (i486-linux-gnu) compiled by GNU C version 4.1.3 20080623 (prerelease) (Ubuntu 4.1.2-23ubuntu3). And, as I said,(I have been using Ubunut since Dapper(!) and) I have never had this happen to me before. All rights reserved. click site See for instructions.

See for instructions. If int doesn't help try posting your env env I'll post it, anyway... :) ORBIT_SOCKETDIR=/tmp/orbit-navneeth SSH_AGENT_PID=5251 GPG_AGENT_INFO=/tmp/seahorse-D6Xd1N/S.gpg-agent:5296:1 SHELL=/bin/bash TERM=xterm XDG_SESSION_COOKIE=0194efc135d1d53e12c5d900462c5b6 0-1233771183.982631-1677968814 GTK_RC_FILES=/etc/gtk/gtkrc:/home/navneeth/.gtkrc-1.2-gnome2 WINDOWID=31457339 USER=navneeth LS_COLORS=no=00:fi=00:di=01;34:ln=01;36:pi=40;33:s o=01;35:do=01;35:bd=40;33;01:cd=40;33;01:or=40;31; 01:su=37;41:sg=30;43:tw=30;42:ow=34;42:st=37;44:ex =01;32:*.tar=01;31:*.tgz=01;31:*.svgz=01;31:*.arj= 01;31:*.taz=01;31:*.lzh=01;31:*.lzma=01;31:*.zip=0 1;31:*.z=01;31:*.Z=01;31:*.dz=01;31:*.gz=01;31:*.b z2=01;31:*.bz=01;31:*.tbz2=01;31:*.tz=01;31:*.deb= If you want to run ldd you should do it like this. See for instructions.

Does anyone know this encoding? Could you try to invoke gcc using this more explicit command?/usr/bin/gcc sourcefile.c -o helloworld. What am I missing? I'd appreciate any help in solving this issue.

Affecting: gcc-4.4 (Ubuntu) Filed here by: Dmitry Pankratov When: 2010-09-18 Confirmed: 2010-09-20 Target Distribution Baltix BOSS Juju Charms Collection Elbuntu Guadalinex Guadalinex Edu Kiwi Linux nUbuntu PLD Linux Tilix tuXlab Ubuntu Target: i486-linux-gnu Configured with: ../src/configure -v --enable-languages=c,c++,fortran,objc,obj-c++ --prefix=/usr --enable-shared --with-system-zlib --libexecdir=/usr/lib --without-included-gettext --enable-threads=posix --enable-nls --with-gxx-include-dir=/usr/include/c++/4.2 --program-suffix=-4.2 --enable-clocale=gnu --enable-libstdcxx-debug --enable-objc-gc --enable-mpfr --enable-targets=all --enable-checking=release --build=i486-linux-gnu --host=i486-linux-gnu --target=i486-linux-gnu Thread model: posix gcc version 4.2.4 navneethFebruary 5th, 2009, 07:34 AMJust to be sure...