Home > Internal Compiler > Internal Compiler Error Segmentation Fault Xcode 4

Internal Compiler Error Segmentation Fault Xcode 4

Contents

Although the release notes don't say this, Xcode 3.2.5 + recent 11.1.x compilers work together just fine. Not the answer you're looking for? Get first N elements of parameter pack Finding the distance between two points in C++ Keyboard shortcut to search for text in MS Outlook 2007 Can you change classes in the make[2]: *** [delta.o] Error 1 make[1]: *** [all-recursive] Error 1 make: *** [all-recursive] Error 1 If I remove the delta section from the makefile SPTK compiles successfully so it should be check my blog

For example the below line gave errors about "Invalid types for array subscript" with I being declared as an integer. Also, thanks to all the other contributors. I am unable to reproduce this using the exact same gcc version and the source you provided - binary returns "Hello World!" as expected. Current state of Straus's illumination problem Working without compensation, what to do? http://askubuntu.com/questions/312835/gcc-segmentation-fault-on-ubuntu-12-04

Gcc Internal Compiler Error Segmentation Fault

The compiler should be able to disambiguate your type name map with the reserve word map provided that "use new_types" is used or not used according to how you want to Are non-english speakers better protected from (international) Phishing? What are cell phone lots at US airports for? Which Sitecore fields can be rendered using a FieldRenderer How to know if a meal was cooked with or contains alcohol?

As I use bits of test code to see what's happening right before the crash. –user1821626 Nov 13 '12 at 18:07 @user1821626: That would be a compiler error. more stack exchange communities company blog Stack Exchange Inbox Reputation and Badges sign up log in tour help Tour Start here for a quick overview of the site Help Center Detailed And of course 3.2.5 works with 12.0 Update 3. Internal Compiler Error Segmentation Fault Please Submit A Full Bug Report Are ability modifiers/sneak attacks multiplied in a critical hit?

So the command sudo apt-get install --reinstall gcc gcc-4.8 gcc-4.8-base libgcc1 cpp-4.8 did the trick –Amadu Bah Jun 1 '14 at 10:36 add a comment| Your Answer draft saved draft Internal Compiler Error Segmentation Fault Android Copyright © 2011 Apple Inc. Initially it did not find cc1 so I added a soft link. I've used Vis Studio and Code::Blocks and it works fine.

Does anyone know this encoding? How to check access permissions on items for a user via the Security API? EDIT: I tried reinstalling according to @gertyvdijk's suggestion. That seemed to work fine.

  1. Why aren't sessions exclusive to an IP address?
  2. Xcode 3.2.2 (1650) Mac OS X 10.6.6 Top pbro Mon, 05/02/2011 - 14:24 Quoting jimdempseyatthecove In your test program you have a type named "map"Can you rename this to a different
  3. I understand that I can withdraw my consent at any time.
  4. Terms Privacy Opt Out Choices Advertise Get latest updates about Open Source Projects, Conferences and News.
  5. What error are you getting exactly? –Xymostech Nov 13 '12 at 17:58 and what "Linux Compiler" ? –mux Nov 13 '12 at 17:58 @mux They say "g++"
  6. As it did not help, here is the output of apt-cache policy gcc-4.6: gcc-4.6: Installed: 4.6.3-1ubuntu5 Candidate: 4.6.3-1ubuntu5 Version table: *** 4.6.3-1ubuntu5 0 500 http://il.archive.ubuntu.com/ubuntu/ precise/main amd64 Packages 100 /var/lib/dpkg/status and
  7. My compiler version is indeed 11.1.089, sorry for the typo.

Internal Compiler Error Segmentation Fault Android

In car driving, why does wheel slipping cause loss of control? https://sourceforge.net/p/sp-tk/bugs/68/ What is the difference between "al la domo" and "en la domon"? Gcc Internal Compiler Error Segmentation Fault ron Top staghind Mon, 04/25/2011 - 00:00 Each time a description of the change, there is always plenty to talk about around the world. C++: Internal Compiler Error: Segmentation Fault (program Cc1plus) Opencv Thank you all, Peter Top Steve Lionel (Intel) Fri, 05/13/2011 - 18:14 12.0.4 is now available.

The segfault disappears, when one adds -check all to the compile options. click site My question comes when I went to move code from an XCode project to a Codeblocks project. When is it okay to exceed the absolute maximum rating on a part? They are not exempt. Libgcc Internal Compiler Error Segmentation Fault

So we consider that and newer versions 'safe'. What would You-Know-Who want with Lily Potter? Below is the section of code and the error message. news For me to reproduce this, I need: Xcode version?Mac OS X version?

No, thanks Register Lost Password Login Home News Guide Mailing Lists New Ticket Ticket Reports Ticket Search Ticket Query Projects Apple Lossless Audio Codec Calendar and Contacts Server DarwinBuild Darwin Streaming Same result as gcc. –Yuval F Jun 26 '13 at 9:00 1 "I tried reinstalling build-essential" - That's just a metapackage. How to change log levels for apex tests Can I get a `du` grouped by month?

You can get it from the Mac App Store or Apple Developer Connection.

m_size = other.getSize(); m_array = new T[m_size]; for (int i = 0; i < other.getSize(); i++) { m_array[i] = other.getValue(i); } return *this; } share|improve this answer answered Nov 13 '12 I'm using this with 12.0 Update 3 and have been pretty happy with this combo. And which version of Mac OS X. Now I get this message when I try to compile: gcc: internal compiler error: Segmentation fault (program cc1) Compiling the same program with g++ works fine.

Compiler version 11.1.087, ifort (IFORT) 11.1 20100806   AttachmentSize Download test.f9025 KB Download List_manip.f9030.7 KB RSS Top 14 posts / 0 new Last post For more complete information about compiler optimizations, You'll have to reinstall the plain GCC packages to properly reinstall all gcc binaries. You're saying that you're getting a segmentation fautl –Armen Tsirunyan Nov 13 '12 at 18:07 add a comment| up vote 1 down vote Turn on your warnings: g++ -std=c++0x -pedantic -Wall More about the author I am aware that compilers differ in certain ways and was wondering if anyone could help me find my error. #include using namespace std; template class Array {

Strange... That solved the problem! Here's the program: #include int main(int argc, char** argv) { printf("Hello World!"); return 0; } My gcc version is 4.6.3 (Ubuntu/Linaro 4.6.3-1ubuntu5). share|improve this answer answered Nov 13 '12 at 18:02 Armen Tsirunyan 76.5k32216345 Yes, I agree that should be fixed.

Join them; it only takes a minute: Sign up Segment Fault in GNU C++ Compiler up vote 2 down vote favorite I am trying to get this code to compile in BUT it doesn't affect 12.0 compilers. I now think you mean /usr/lib/gcc/x86_64-linux-gnu/4.6/cc1 from the cpp-4.6 package - was it absent? So I removed the pointers just to see what happened and other errors began to emerge.

Should a spacecraft be launched towards the East? asked 3 years ago viewed 542 times active 2 years ago Blog Stack Overflow Podcast #91 - Can You Stump Nick Craver? Any guidance as to where I messed up would be appreciated. And as 11.1.088 has issues with the Xcode version installed here (see http://software.intel.com/en-us/forums/showthread.php?t=73942), I will try my luck with the 12.0 compiler.

I think your compiler version/build information was not quite right: I think you meant you have 11.1.089 build 20100806, aka 11.1 Update 7: http://software.intel.com/en-us/articles/intel-compiler-and-composer-update-version-numbers-to-compiler-version-number-mapping/ But more good and bad news: it Try reinstalling GCC and all affecting libraries: sudo apt-get install --reinstall gcc gcc-4.6 gcc-4.6-base libgcc1 cpp-4.6 Specifically the cpp-4.6 package appears to be broken in your setup as /usr/lib/gcc/x86_64-linux-gnu/4.6/cc1 belongs to You said you're on Xcode 4.2; 4.3.3 has been available for a month already. Not the answer you're looking for?

Browse other questions tagged 12.04 64-bit compiling gcc segmentation-fault or ask your own question. I just installed xcode 3.2.4 When compiling several times I have run into the following: internal compiler error: Segmentation fault The full message is below. Xcode Version 2.1 Xcode IDE: 621.0 Xcode Core: 620.0 ToolSupport: 610.0 MAC OS X 10.4.6 1GHz PowerPC G4 gcc version 4.0.0 (Apple Computer, Inc. I am sure this error is not a VisIt problem but something else.

Cheers, Allen g++ -c -pipe -O2 -arch x86_64 -Xarch_x86_64 -mmacosx-version-min=10.5 -fvisibility=hidden -fvisibility-inlines-hidden -Wall -W -fPIC -DQDESIGNER_SDK_LIBRARY -DQDESIGNER_EXTENSION_LIBRARY -DQDESIGNER_UILIB_LIBRARY -DQDESIGNER_SHARED_LIBRARY -DQT_DESIGNER -DQT_FORMBUILDER_NO_SCRIPT -DQT_NO_DEBUG -DQT_XML_LIB -DQT_GUI_LIB -DQT_CORE_LIB -D_LARGEFILE64_SOURCE -D_LARGEFILE_SOURCE -DQT_SHARED -I../../../../mkspecs/macx-g++ -I. -I../../../../include/QtCore Recruiter wants me to take a loss upon hire Why was the identity of the Half-Blood Prince important to the story?