Home > Internal Compiler > Internal Compiler Error Unity

Internal Compiler Error Unity

Contents

I can get them if I make overlapping generic parameters in C#, but as it's an internal error there's probably not much that can be done and you should definitely report Login Create account Language Chinese Spanish Japanese Korean Portuguese Ask a question Spaces Default Help Room META Moderators Topics Questions Users Badges Home / 2 Question by Nievinski · Dec 20, See the console log for more information. Welcome to Unity Answers The best place to ask and answer questions about development with Unity. http://colvertgroup.com/internal-compiler/internal-compiler-error-cl-exe.php

Then, re-open your project and try to compile. Sometime's it's Unity itself. Linked 7 DllNotFoundException in unity3d plugin for c++ dll Related 4Code Stripping Errors Unity0Unity plugin conflict in WP82How can I include SWIG-wrapped C++ in Unity 3D?1Unity3D call external dll3Creating Wp8 Unity If you're doing it for iOS make sure that you don't have any events declared inside the DLL. http://answers.unity3d.com/questions/600237/how-to-solve-internal-compiler-error.html

Unity Internal Compiler Error Unhandled Exception

Comment Add comment · Show 3 10 |3000 characters needed characters left characters exceeded ▼ Viewable by all users Viewable by moderators Viewable by moderators and the original poster Advanced visibility B) This made me realize that the internal compiler error must be happening at some specific line in some specific file, and that once it hit that line, it stopped compiling Theres a place you can add exceptions to this, to force the compiler to include a Generic implementation your code is using that it can't find, but I can't find it

To help users navigate the site we have posted a user guide. Comment Add comment · Show 1 · Share 10 |3000 characters needed characters left characters exceeded ▼ Viewable by all users Viewable by moderators Viewable by moderators and the original poster share|improve this answer answered Mar 24 '14 at 9:40 SteakOverflow 1,0161229 add a comment| up vote 1 down vote What worked for me was setting the target platform lower(from 4.5 to Internal Compiler Error Segmentation Fault I am guessing it has something to do with the fact that FirstOrDefault is returning something the compiler is not able to resolve properly.

Ie: Arguments.FirstOrDefault(a => a.Item3 != null); // I think? Unity Internal Compiler Error Access Denied I tried the deleting the file under the temp folder but it doesn't fix it. Comment Add comment · Share 10 |3000 characters needed characters left characters exceeded ▼ Viewable by all users Viewable by moderators Viewable by moderators and the original poster Advanced visibility Viewable at System.IO.FileStream..ctor (System.String path, FileMode mode, FileAccess access, FileShare share, Int32 bufferSize, Boolean anonymous, FileOptions options) [0x00000] in :0 at System.IO.FileStream..ctor (System.String path, FileMode mode, FileAccess access, FileShare share, Int32 bufferSize,

Moved the CompileBreaker to the next file. Internal Compiler Error In Push_minipool_fix Login Create account Forums Answers Feedback Issue Tracker Blog Evangelists User Groups Navigation Home Unity Industries Showcase Learn Community Forums Answers Feedback Issue Tracker Blog Evangelists User Groups Get Unity Asset Went through the uninstall and restarted my computer and I was back in business. I am blocked on my project and not sure where to go to get help beyond posting here.

  • Stack Trace: Internal compiler error.
  • Welcome to Unity Answers The best place to ask and answer questions about development with Unity.
  • We are making improvements to UA, see the list of changes.
  • For troubleshooting common problems with Unity 5.x Editor (including Win 10).
  • I tried to further refine my search to include my particular error and didn't get any smaller result set even though when I look at many of the other posts about
  • If so please post your fixes.
  • Here is the file I found to have caused the internal compiler error, with the error-causing line marked: using System; namespace ManagedLzma.LZMA.Master { public static partial class LZMA // <<< the
  • Internal compiler error.
  • output was: Unhandled Exception: System.UnauthorizedAccessException: Access to the path "C:\Users\Public\Documents\Unity Projects\Database\Temp\Assembly-CSharp-firstpass.dll.mdb" is denied.
  • output was:Successfully compiled '22' file(s) to 'C:\Users\Brandon\Desktop\Drone Wars\DroneWars_Files\12-6-12\MediaFair\Temp\Assembly-UnityScript.dll'.

Unity Internal Compiler Error Access Denied

McAfee was mentioned by name. Comment Add comment · Show 8 10 |3000 characters needed characters left characters exceeded ▼ Viewable by all users Viewable by moderators Viewable by moderators and the original poster Advanced visibility Unity Internal Compiler Error Unhandled Exception This is what caused the internal compiler error for me: (the below is trimmed, so hopefully I didn't leave out anything important) public struct P { public readonly T[] mBuffer; public Unity Internal Compiler Error Dll To help users navigate the site we have posted a user guide.

Kudos! 0 Answer by Tarlius · Feb 27, 2013 at 06:24 AM It sounds like compiler might be confused and "optimising" one of the implementations of a Generic that you "aren't click site The big question is what do I do about it? Related Questions When I build my game it gives me this error 'Assets/Builds/Build_0.01_Data/Managed/Assembly-CSharp.dll' shouldn't be queried by IsAssemblyCompatible, missing IsInternalOrCompiledAssembly check ? 1 Answer Precompile shader 1 Answer Hi, How can Comment Add comment · Share 10 |3000 characters needed characters left characters exceeded ▼ Viewable by all users Viewable by moderators Viewable by moderators and the original poster Advanced visibility Viewable Internal Compiler Error Segmentation Violation Signal Raised

I found the cause of my 'internal compiler error' in the second file, "Core.cs". Related Questions Internal Compiler Error 0 Answers unknown database error 1 Answer error CS0016 - Access to the path is denied 1 Answer Internal Compiler Error 6 Answers Internal Compiler Error I have experienced other issues that convinced me that version 4 is not production quality yet. http://colvertgroup.com/internal-compiler/internal-compiler-error-gcc.php If you are a new user, check out our FAQ for more information.

Internal compiler error. Internal Compiler Error Killed (program Cc1plus) It works fine when I launch the game within the editor but if I try to compile I get the following: Internal compiler error. See the console log for more information.

output was:error CS0016: Could not write to file `Temp/Assembly-CSharp-firstpass.dll', cause: Access to the path "C:\Users\JGM\Documents\New Unity Project 1\Temp\Assembly-CSharp-firstpass.dll.mdb" is denied.

Which brings me to my next point, which is that... Login Create account Language Chinese Spanish Japanese Korean Portuguese Ask a question Spaces Default Help Room META Moderators Topics Questions Users Badges Home / 1 Question by PProductions · Sep 15, meat5000 · Oct 22, 2013 at 11:57 PM 1 Share It suggests your Unityscript.dll may have been flagged by AV at some point? Internal Compiler Error Illegal Instruction Here is what the console.log gave me after I tried to make a script: Internal compiler error.

If you are a moderator, see our Moderator Guidelines page. Browse other questions tagged c# c++ plugins dll unity3d or ask your own question. Welcome to Unity Answers The best place to ask and answer questions about development with Unity. http://colvertgroup.com/internal-compiler/internal-compiler-error-net.php You can probably fix the problem just by restarting your computer, but if you don't want to do that, you can figure out who is locking a file using the excellent

Follow this Question Answers Answers and Comments 17 People are following this question. Uninstalled that garbage immediately. 1 Reply · Add your reply Sort: 0 Answer by source.transformer · Feb 18, 2015 at 06:59 PM This worked for me as well. Welcome to Unity Answers The best place to ask and answer questions about development with Unity. System.Reflection.ReflectionTypeLoadException: The classes in the module cannot be loaded1Integrate nhibernate with Unity3D Hot Network Questions Is it illegal for regular US citizens to possess or read the Podesta emails published by

meat5000 · Oct 22, 2013 at 11:49 PM 0 Share Maybe it's related? Login Create account Language Chinese Spanish Japanese Korean Portuguese Ask a question Spaces Default Help Room META Moderators Topics Questions Users Badges Home / 0 Question by eliteslayer · Mar 02, And if it is locked how can I unlock it so the file is not denied as it said in the error. 1 Reply · Add your reply Sort: 0 Answer Finding Signs of Life from afar What happens if one brings more than 10,000 USD with them into the US?

Login Create account Language Chinese Spanish Japanese Korean Portuguese Ask a question Spaces Default Help Room META Moderators Topics Questions Users Badges Home / 1 Question by The_Thinker · Feb 22, Comment Add comment · Share 10 |3000 characters needed characters left characters exceeded ▼ Viewable by all users Viewable by moderators Viewable by moderators and the original poster Advanced visibility Viewable We are making improvements to UA, see the list of changes. I made a small plugin for Unity and imported the dll into my project folder.

Login Create account Language Chinese Spanish Japanese Korean Portuguese Ask a question Spaces Default Help Room META Moderators Topics Questions Users Badges Home / This question was closed Oct 23, 2013 Each time the CompileBreaker code is reached, you know the code up to that point is fine, so you just move it to the bottom of the next file.