Home > Internal Compiler > Internal Error Killed Program Cc1plus

Internal Error Killed Program Cc1plus

Contents

Re: g++: internal compiler error: Killed (program cc1plus) September 29, 2013, 04:42:40 AM #3 I agree with GoldenWings91. KayEss commented Feb 20, 2014 Ok, I worked out the yaml issue in the end, but now that I'm getting 4.8 compiling I still get the exact same crash :( Travis If this is the case, you are running out of memory. YES. http://colvertgroup.com/internal-compiler/internal-compiler-error-killed-program-cc1plus.php

See for instructions. The one that scores the highest gets killed by the operating system to free up memory. yajingfu commented Feb 5, 2015 @rhyolight haha, thank you, I build nupic successfully :) rhyolight closed this Feb 5, 2015 dmitry-sukhoruchkin commented Jun 15, 2015 Math library source file generated with KayEss commented Feb 18, 2014 Here is one of the files that failed: $ /usr/bin/time --verbose -- "g++" -ftemplate-depth-128 -O0 -fno-inline -Wall -g -pthread -fPIC -fdiagnostics-show-option -fno-strict-aliasing -DBOOST_VERSION_MAJOR=46 -DDEBUG -DFOST_OS_LINUX -DFOST_TOOLSET_GCC

Internal Compiler Error Gcc

Version-Release number of selected component (if applicable): [ec2-user@ip-172-31-32-42 proxy]$ cat /etc/redhat-release Red Hat Enterprise Linux Server release 6.4 (Santiago) [ec2-user@ip-172-31-32-42 proxy]$ gcc -v Using built-in specs. I'm guessing memory load on some of the other libraries that build on this could be even higher. This Programming Thing This Programming Thing Blogging about PHP, MySQL, Zend Framework, MySQL, Server Administration and Programming in general För att kunna använda diskussioner i Google Grupper måste du aktivera JavaScript How to create a company culture that cares about information security? 기계 (gigye) ==> 機械, 器械, 奇計 (what else?) more hot questions question feed default about us tour help blog chat

Go to gcc.gnu.org/bugs –Gil Hamilton Jun 18 '15 at 13:21 | show 8 more comments 1 Answer 1 active oldest votes up vote 9 down vote Try running (just after the If you're lucky, you'll find a clue about your next step. –donjuedo Jun 17 '15 at 9:32 1 Also, drop the "-j 8". COLLECT_GCC=gcc COLLECT_LTO_WRAPPER=/usr/libexec/gcc/arm-angstrom-linux-gnueabi/4.5.3/lto-wrapper Target: arm-angstrom-linux-gnueabi Configured with: /home/oe-classic/oe/build/tmp-angstrom_2010_x/work/armv7a-angstrom-linux-gnueabi/gcc-4.5-r38.1+svnr170880/gcc-4_5-branch/configure --build=x86_64-linux --host=arm-angstrom-linux-gnueabi --target=arm-angstrom-linux-gnueabi --prefix=/usr --exec_prefix=/usr --bindir=/usr/bin --sbindir=/usr/sbin --libexecdir=/usr/libexec --datadir=/usr/share --sysconfdir=/etc --sharedstatedir=/com --localstatedir=/var --libdir=/usr/lib --includedir=/usr/include --oldincludedir=/usr/include --infodir=/usr/share/info --mandir=/usr/share/man --with-libtool-sysroot=/home/oe-classic/oe/build/tmp-angstrom_2010_x/sysroots/armv7a-angstrom-linux-gnueabi --enable-largefile --disable-nls --enable-ipv6 --with-gnu-ld --enable-shared --enable-languages=c,c++,objc,fortran Swapon Failed: Operation Not Permitted If that is proprietary, you could try to reduce it yourself and obfuscate, see e.g.

When trusty comes out in April will you upgrading to that? And the GCC trunk does report a fatal, but understandable, error. See for instructions. learn this here now Reload to refresh your session.

The code is quite template heavy in places. Ubuntu Add Swap I am not sure that would be accepted as a GCC bug. share|improve this answer answered Oct 27 '12 at 19:30 Pete Becker 39.4k33080 1 @Andrew Tomazos: Yes; and please take time to report that bug on gcc.gnu.org/bugzilla –Basile Starynkevitch Oct 27 This will mean fewer parallel jobs and will mean the compilation will take longer but hopefully will not exhaust your system memory.

C++ Internal Compiler Error Segmentation Fault (program Cc1plus)

Anyway, this error almost always means GCC needed more memory than was available on the system, you might need to crosscompile from a machine with more memory. -- Configure bugmail: http://gcc.gnu.org/bugzilla/userprefs.cgi?tab=email http://stackoverflow.com/questions/30887143/make-j-8-g-internal-compiler-error-killed-program-cc1plus I also hope that it is nothing related to gcc compiler. Internal Compiler Error Gcc I thought adding "--param ggc-min-expand=3 --param ggc-min-heapsize=5120" to CXX_FLAGS would help by triggering garbage collection more often, but I don't think it did. Gcc Internal Compiler Error Killed (program Cc1) Pages: [1] Print Bitcoin Forum>Bitcoin>Technical Support (Moderator: achow101)>[SOLVED] g++: internal compiler error: Killed (program cc1plus) « previous topic next topic » Jump to: Please select a destination: -----------------------------

GoldenWings91 Full Member Offline Activity: 141 Re: g++: internal compiler error: Killed (program cc1plus) September 29, 2013, 04:36:14 AM #2 Sounds as if your out of memory try adding even more http://colvertgroup.com/internal-compiler/internal-compiler-error-c.php After reading this post about the same error message, I shut down my Ubuntu VM and changed the settings to give it more Base Memory. everything.Anyway i keep getting this error:http://pastebin.com/w14BVNALg++: internal compiler error: Killed (program cc1plus)Please submit a full bug report,with preprocessed source if appropriate.See for instructions.make: *** [obj/alert.o] Error 4All dependencys are fine, make[2]: *** [gnuradio-core/src/lib/swig/CMakeFiles/_gnuradio_core_general.dir/gnuradio_core_generalPYTHON_wrap.cxx.o] Error 1 make[1]: *** [gnuradio-core/src/lib/swig/CMakeFiles/_gnuradio_core_general.dir/all] Error 2 make: *** [all] Error 2 Comment 2 Jonathan Wakely 2013-02-01 23:30:57 UTC (In reply to comment #1) > ERROR: Internal error: Increase Swap Space Raspberry Pi

I'm going to try to replicate it in a VM today. Reload to refresh your session. What is the exchange interaction? click site If you have any ideas, we're open to anything.

Format For Printing -XML -Clone This Bug -Top of page First Last Prev Next This bug is not in your last search results. Increase Swap Space Ubuntu KayEss closed this May 6, 2014 henrikhodne removed the awaiting-followup label May 6, 2014 Bilge commented Sep 29, 2014 I am having the same problem building crosstool-NG today. We recommend upgrading to the latest Safari, Google Chrome, or Firefox.

Sign in to comment Contact GitHub API Training Shop Blog About © 2016 GitHub, Inc.

Is that cpp file a complex/big one? I presume you're not allowing anywhere near that sort of memory load. Sign in to comment Contact GitHub API Training Shop Blog About © 2016 GitHub, Inc. Vagrant Increase Memory This was referenced May 27, 2015 Open sporadic failures with travis "g++: internal compiler error: Killed (program cc1plus)" kashefy/elm#60 Open get travis-ci to build and run models stan-dev/example-models#26 Merged WIP: CI

Will they need replacement? [email protected]:~/edison/nupic# uname -a Linux ubilinux 3.10.17-yocto-standard-r2 #7 SMP PREEMPT Thu Feb 26 09:57:06 UTC 2015 i686 GNU/Linux [email protected]:~/edison/nupic# /usr/bin/clang-3.5 -DNDEBUG -g -fwrapv -O2 -Wall -Wstrict-prototypes -fno-strict-aliasing -D_FORTIFY_SOURCE=2 -g -fstack-protector-strong -Wformat -Werror=format-security micbou closed this Sep 15, 2015 zhongke commented Sep 22, 2015 ok. navigate to this website I'll try again when the new versions of g++ become available and see if any of those work out better.

Make an ASCII bat fly around an ASCII moon How to DM a no-equipment start when one character needs something specific? Maybe it'd be worth installing gcc 4.8 on our current systems for the time being? to get it working?" I would suggest running "make -j 8 VERBOSE=1" just to see if anything on the g++ command line does not look like what you expect. You signed out in another tab or window.

They may be unsafe, untrustworthy, or illegal in your jurisdiction. In any case, there is nothing that can be done about it without a preprocessed testcase. Previous company name is ISIS, how to list on CV? Anyway, this error almost always means GCC needed more memory than was available on the system, you might need to crosscompile from a machine with more memory.

We recommend upgrading to the latest Safari, Google Chrome, or Firefox. The fix was to do the following:Code:freedd if=/dev/zero of=/var/swap.img bs=1024k count=1000mkswap /var/swap.imgswapon /var/swap.imgfreemake -f makefile.unixRegardless of what the first poster said. Numenta member breznak commented Feb 4, 2015 @rhyolight cool detective work! 👍 added mention to the wiki https://github.com/numenta/nupic/wiki/Installing-NuPIC-on-Ubuntu Numenta member rhyolight commented Feb 4, 2015 Thanks, Marek! You signed in with another tab or window.

Peter Land - What or who am I? i> struct F { static constexpr A f() { return A{{ ::f(i)... }}; } }; template struct C {}; template

Determine, for sure, whether it's virtual memory exhaustion or not. Comment 2 Xiong Zou 2014-04-25 04:42:29 EDT Hi Jakub, Thanks for getting back to me so promptly. GCC 4.6.3 is the oldest still supported release. Does that mean gcc builds aren't going to be an option on travis?

Skip to content Ignore Learn more Please note that GitHub no longer supports old versions of Firefox.