Home > Windows 10 > Install Wizard Error

Install Wizard Error

Contents

Please try again now or at a later time. I was attempting to do a per-user install of v4.6.0 on 64-bit (Windows) - "Microsoft Windows 7 Professional 6.1.7601 Service Pack 1 Build 7601" via msiexec /I node-v4.6.0-x64.msi ALLUSERS=2 MSIINSTALLPERUSER=1 I permalinkembedsaveparentgive gold[–]SuperRitzFernando[S] 0 points1 point2 points 8 months ago(0 children)Nah man, it didn't work! :( permalinkembedsaveparentgive gold[–]v3r50n 0 points1 point2 points 8 months ago(0 children)Got the beta and have the same issue as well. All rights reserved.REDDIT and the ALIEN Logo are registered trademarks of reddit inc.πRendered by PID 4577 on app-557 at 2016-10-18 22:32:21.759013+00:00 running 2ad1404 country code: SE. check over here

permalinkembedsavegive gold[–]SuperRitzFernando[S] 0 points1 point2 points 8 months ago(0 children)Thanks, I will try it when I get home! Discussion is locked Flag Permalink You are posting a reply to: InstallShield Wizard not allowing installation The posting of advertisements, profanity, or personal attacks is prohibited. Not sure quite where your error is - interesting that it's happening on all versions. The Temp folder will open.5.

1607 Unable To Install Installshield Scripting Runtime Windows 7

The system returned: (22) Invalid argument The remote host or network may be down. Facebook Twitter Google+ YouTube LinkedIn Tumblr Pinterest Newsletters RSS Sign in Submit a request My activities English (US) Deutsch Español Français (France) Italiano 日本語 Nederlands Polski Português do Brasil 简体中文 繁體中文 If you need help, you may report this error at: npm ERR! All submitted content is subject to our Terms of Use.

  • Windows Installer manages the installation of software, manages the additions and deletions of software components, monitors file resiliency, and maintains basic disaster recovery by using rollbacks.
  • Please refer to our CNET Forums policies for details.
  • Before downloading and installing the program please delete Windows Temporary Files.
  • You signed out in another tab or window.
  • After I had deleted this entry, node installation passed fine.
  • Hope this helps. Категория Хобби и стиль Лицензия Стандартная лицензия YouTube Ещё Свернуть Загрузка... Реклама Автовоспроизведение Если функция включена, то следующий ролик начнет воспроизводиться автоматически. Следующее Kodi Script Errors - The
  • Already have an account?
  • Previously it worked when an older version was installed and 6.3 was installed with nvm (node version manager) strangely enough.
  • You are free to see if any of the following may be or help, log further information which may be helpful, or disregard it all together:1. "Windows Installer (Q310598)" is not

Empty your temporary folder. Thank you! Thanks all! 👍 3 🎉 2 joaocgreis referenced this issue Jul 11, 2016 Open Cannot install Node.js 4.47 LTS under Win7 x64. #7621 MarkPieszak commented Jul 21, 2016 Win7 64-bit 1628 Failed To Complete Installation Windows 10 And are you sure you're logged on as an administrator (in Windows XP)?

joaocgreis referenced this issue May 3, 2016 Closed NodeJS install problem - Error 1603 #6547 yogibear54 commented May 17, 2016 @ilkercat thanks! Installshield 1628 Failed To Complete Installation Reload to refresh your session. C:\WINDOWS\system32\npm-debug.log *npm-debug.log * : 0 info it worked if it ends with ok 1 verbose cli [ 'C:\Program Files\nodejs\node.exe', 1 verbose cli 'C:\Users\firstName Lastname\AppData\Roaming\npm\node_modules\npm\bin\npm-cli.js' ] 2 info using [email protected] 3 info Nodejs.txt 👍 1 Fishrock123 added the install label Dec 17, 2015 Compynerd255 commented Dec 17, 2015 Wherever your problem is, it's somewhere between lines 25928 and 25970 - before that,

The Run dialog box will appear. Error 1607 Fsx Temporarily disable your Windows Firewall, antivirus ( for antivirus requiring time frame, please click on permanent ) and UAC ( User Access Control Settings) to allow the installation process. Generated Wed, 19 Oct 2016 00:32:20 GMT by s_wx1011 (squid/3.5.20) {{offlineMessage}} Store Store home Devices Microsoft Surface PCs & tablets Xbox Virtual reality Accessories Windows phone Software Office Windows Additional software Then it got installed.

Installshield 1628 Failed To Complete Installation

http://github.com/npm/npm/issues npm ERR!

There was an older version of nodejs on my machine installed before. 1607 Unable To Install Installshield Scripting Runtime Windows 7 It would be nice if someone can share the its use, as I'm in learning phase. 1607 Unable To Install Installshield Scripting Runtime Windows 10 You signed in with another tab or window.

Sign in to comment Contact GitHub API Training Shop Blog About © 2016 GitHub, Inc. check my blog {{offlineMessage}} Store Store home Devices Microsoft Surface PCs & tablets Xbox Virtual reality Accessories Windows phone Software Office Windows Additional software Apps All apps Windows apps Windows phone apps Games Xbox Supplemental reading:a. "How to Enable Windows Installer Logging in Windows XP (Q314852)." b. "The Command-Line Options for the Microsoft Windows Installer Tool Msiexec.exe (Q314881)" which you may need to use in samarthRT commented Mar 26, 2016 Hi @joaocgreis, m facing another issue. Installshield Error 1628

it is an extensible software management system. Windows Installer 4.5 -http://www.microsoft.com/download/en/details.aspx?id=8483 2. You'll find discussions about fixing problems with computer hardware, computer software, Windows, viruses, security, as well as networks and the Internet.Real-Time ActivityMy Tracked DiscussionsFAQsPoliciesModerators General discussion InstallShield Wizard not allowing installation this content Reload to refresh your session.

Click Start2. Installshield Error 1607 Windows 7 Please try the request again. All rights reserved.

The error codes numbered greater than 2000 are internal errors and do not have authored strings, but these can occur if the installation package has been incorrectly authored (an SDK Documentation).4.

Click Run3. Once reported, our moderators will be notified and the post will be reviewed. Your npm is installed under appdata, so can you try: rmdir /s C:\Users\firstName Lastname\AppData\Roaming\npm npm install npm If that doesn't help, perhaps the best way forward would be to ask on 1607 Error Windows 10 SIGN UP FOR THE GAME HERE JOIN OUR DISCORD CHAT JOIN OUR STEAM GROUP OUR RULES FAQ Paladins Community Chatrooms IRC Link /r/Paladins on Discord /r/Paladins on Steam Websites Official Website

Track this discussion and email me when there are updates If you're asking for technical help, please be sure to include all your system info, including operating system, model number, and Preview post Submit post Cancel post You are reporting the following post: InstallShield Wizard not allowing installation This post has been flagged and will be reviewed by our staff. If you believe this post is offensive or violates the CNET Forums' Usage policies, you can report it below (this will not automatically remove the post). have a peek at these guys The root cause for this may be wixtoolset/issues#4462/ .

The error codes numbered 1000 to 1999 are ship errors and must be authored into the Error table. As a work around, temporarily disable your windows firewall and antivirus and use a web browser other than Internet Explorer such as Mozilla Firefox or Google Chrome. Terms Privacy Security Status Help You can't perform that action at this time. Thanks!

Permalink Please sign in to leave a comment. code MODULE_NOT_FOUND npm ERR! argv "C:\Program Files\nodejs\node.exe" "C:\Users\firstName lastName\AppData\Roaming\npm\node_modules\npm\bin\npm-cli.js" npm ERR! Node.js Foundation member joaocgreis commented Jan 8, 2016 @samarthRT Can you make sure there is no previous version installed in Control Panel, and uninstall it from there if there is?

You won't be able to vote or comment. 123InstalShield Wizard error, can't install the game! (self.Paladins)submitted 8 months ago * by SuperRitzFernandoSo guys, any help is appreciated. andybakerbrfc commented Oct 14, 2016 Hi folks, Just adding a +1 on this issue. Related articles CorelDRAW Technical Suite X7 Update 3 - Lattice3D cannot be activated Pinnacle Studio 19 – Patch Update is now available Next button is greyed out on End User License Learn more You're viewing YouTube in Russian.

node v5.9.0 npm ERR! Unselecting the "performance counter" during the installation did the job for me, but I have run the req queries which you provided and got a result for the second one: C:\Windows\system32>reg by Kees Bakker / January 12, 2005 10:07 PM PST In reply to: InstallShield Wizard not allowing installation Lot's of troublesome interfering factors absent then. Thank you for helping us maintain CNET's great community.

Click on Yes to confirm.--If you'd instead like to remove everything inside the Temp folder, click on the Organize button and then choose Select All from the menu Tips: You may Hit Ctrl+A on the keyboard to Select All-Hit the Delete key and then press OK or hit Enter to the message asking if you are sure you wish to deleteNote: Skip Make sure you have another hi rez game installed. (the smite one worked for me) You can close out of the launcher when the it asks you to install. We can reopen if this becomes an issue for you again.

Microsoft Direct X End- User Runtime Web Installer -http://www.microsoft.com/download/en/details.aspx?id=35 6.